{"text_format":"1","workbook":"xlsx","n_sheets":19,"sheets":["Toolkit Instructions","Absorption Ratio","Site & Neighborhood Standards","1 Capacity","2 Soundness of Approach","2.3 Land Use & Zoning","3 Leverage and Committed Funds","4 Supportive Services","5 Physical Design","5a.Operating Cost Standard","5b. Operating Pro Forma","6. Intergenerational ","Documentation Checklist","HUD ONLY - Intake Review","HUD ONLY - Environmental","HUD ONLY - Scoresheet","HUD 2022 Operating Cost Std","List Validations","HUD 2023 TDC"],"not_rendered":{"charts":0,"images":0,"macros":1,"external_links":1,"defined_names":4,"comments":0,"pivot_tables":0},"unopened":[],"bounds":{"document_bytes":16777216,"sheet_cells":100000,"rows_first":2000,"rows_last":500,"rows_between":2000,"halvings":0,"cell_chars":16384,"cell_head_chars":4096},"cells_cut":0,"cells_raw":0,"read":"whole","date_system":"1900"}

{"sheet":"Toolkit Instructions","index":0,"n_rows":18,"n_cols":4,"rows_kept":18,"cut":false,"hidden":false,"merged":[[15,3,15,12],[2,2,2,12],[4,3,4,12],[6,3,6,12],[11,3,11,12],[13,3,13,12]]}
[]
[]
[null,null,"FY23 202 NOFO Toolkit"]
[]
[null,null,"Project Name:"]
[]
[null,null,"Project Sponsor:"]
[]
[null,null,"Project Location: City, State"]
[]
[]
[null,null,"Sponsor Unique Entity Identifier (UEI):"]
[]
[null,null,"Sponsor UEI Expiration Date:"]
[]
[null,null,"Sponsor Employer Identification Number (EIN):"]
[]
[null,null,"Are you applying for funding for intergenerational units? ","Choose one"]

{"sheet":"Absorption Ratio","index":1,"n_rows":50,"n_cols":7,"rows_kept":50,"cut":false,"hidden":false,"merged":[]}
[]
[]
[null,null,"Threshold Requirement: Absorption Ratio"]
[]
[null,null,{"$f":"IF('Toolkit Instructions'!E5=\"\",\"Enter Project Name on Instructions Tab\",CONCATENATE(\"Project Name: \",'Toolkit Instructions'!E5))","v":"Enter Project Name on Instructions Tab"}]
[]
[null,null,{"$f":"IF('Toolkit Instructions'!$D$7=\"\",\"Enter Project Sponsor on Instructions Tab\",CONCATENATE(\"Project Sponsor: \",'Toolkit Instructions'!$D$7))","v":"Enter Project Sponsor on Instructions Tab"}]
[]
[]
[]
[]
[]
[]
[]
[]
[]
[]
[]
[]
[]
[]
[]
[]
[]
[]
[]
[null,null,"A. Absorption Ratio"]
[]
[null,null,"1. Did you use ACS Survey data at the CBSA or County level?",null,null,null,"Choose one"]
[]
[null,null,"2. Enter the name of the CBSA or County selected:"]
[]
[null,null,"3. Enter the name of the State & County or HUD Metro Fair Market Area (HMFA) selected in the FY 2023 Income Limits Documentation System:"]
[]
[null,null,"4. What is the 2023 Very Low (50%) Income Limit for 1-person households in the chosen area?"]
[]
[null,null,"5. What is the sum of the total number of 1-person households at or below the 50% Income Limit?"]
[]
[]
[null,null,"6. What is the total number of PRAC units in the project?"]
[]
[]
[null,null,null,null,"Calculated Absorption Ratio:",null,{"$f":"IF(G40<>\"\",G40/G37,\"\")","v":""}]
[]
[]
[null,null,"Threshold","Condition","Requirement","Compliant"]
[null,null,"Absorption Ratio",{"$f":"G43","v":""},"30% or below",{"$f":"IF(G43<=0.3,\"Yes\",\"No\")","v":"No"},"Absorption ratio must be 30% or below. Site is ineligible."]
[]
[]
[null,null,"Additional Comments"]

{"sheet":"Site & Neighborhood Standards","index":2,"n_rows":63,"n_cols":17,"rows_kept":63,"cut":false,"hidden":false,"merged":[]}
[]
[]
[null,null,null,null,"Threshold Requirement: Site and Neighborhood Standards "]
[]
[null,null,null,null,{"$f":"IF('Toolkit Instructions'!D5=\"\",\"Enter Project Name on Instructions Tab\",CONCATENATE(\"Project Name: \",'Toolkit Instructions'!D5))","v":"Enter Project Name on Instructions Tab"}]
[]
[null,null,null,null,{"$f":"IF('Toolkit Instructions'!$D$7=\"\",\"Enter Project Sponsor on Instructions Tab\",CONCATENATE(\"Project Sponsor: \",'Toolkit Instructions'!$D$7))","v":"Enter Project Sponsor on Instructions Tab"}]
[]
[]
[]
[]
[]
[null,null,null,null,null,null,"Elderly Minority Concentration Tool"]
[]
[]
[]
[]
[]
[null,null,null,null,"A. Elderly Minority Concentration",null,null,null,null,null,null,null,"Tool","Adjacent","Sufficient","Overriding - Rev Area","Overriding - Rev Strategy"]
[null,null,null,null,null,null,null,null,null,null,null,null,{"$f":"G21","v":"Insufficient data"},{"$f":"IF(OR(G21=\"Insufficient data\",G21=\"Yes\"),\"n/a\",G23)","v":"n/a"},{"$f":"IF(OR(G21=\"No\",G21=\"Insufficient data\"),\"n/a\",#REF!)","v":"n/a"},{"$f":"IF(OR(G21=\"No\",G21=\"Insufficient data\"),\"n/a\",#REF!)","v":"n/a"},{"$f":"IF(OR(G21=\"No\",G21=\"Insufficient data\"),\"n/a\",#REF!)","v":"n/a"}]
[null,null,null,null,"1. Does the Elderly Minority Concentration Analysis Tool indicate your site is in an area of minority concentration?",null,"Insufficient data"]
[]
[null,null,null,null,"1a. Does the tool indicate that your proposed site is near the edge of a minority-concentrated census tract?",null,"No"]
[]
[null,null,null,null,"2. Are you proposing an alternate geography to define the neighborhood? ",null,"No"]
[]
[null,null,null,null,"3b. Provide a description of the alternative geography of the neighborhood, including a justification of why it is a better representation of neighborhood boundaries than the census tract."]
[]
[]
[]
[]
[]
[]
[]
[]
[]
[]
[null,null,"4. Which exception are you claiming?"]
[]
[null,null,null,null,"Sufficient, comparable housing existis outside areas of minority concentration"]
[null,null,null,null,"Pursuant to the sufficient, comparable opportunities exception, units may be considered comparable opportunities if they have the same household type (elderly) and tenure type (renter); require approximately the same total tenant payment; serve the same income group; are located in the same housing market; and are in standarf condition.  To meet this exception, the Applicant must explain the applicability of the factors discussed in 24 CFR, Part 891.125(c)(3)(iii)(A)-(G) in the Site and Neighborhood Standards submission in Tab I.  `"]
[]
[]
[]
[]
[null,null,null,null,"Project is necessary to meet overriding housing needs, and the site is part of a revitalization strategy"]
[null,null,null,null,"The “overriding housing need” analysis (see 24 CFR, Part 891.125(c)(4)) permits approval of sites that are an integral part of an overall local strategy for the preservation or restoration of the immediate neighborhood (for example, where there is a robust local strategy where affordable housing is not the only or primary anticipated investment) (a “revitalization strategy”). The Section 202 Elderly Minority Concentration Tool contains a revitalization report that the applicant may use to inform this analysis. See the NOFO for more details on what qualifies as \"overriding housing need.\" Provide your analysis in Tab I."]
[]
[]
[]
[]
[]
[null,null,null,null,"Project is necessary to meet overriding housing needs, and the site is in a revitalizing area"]
[null,null,null,null,"The “overriding housing need” analysis (see 24 CFR, Part 891.125(c)(4)) permits approval of sites that are in an area where there is significant private investment in the neighborhood that is demonstrably changing the economic character of the area (“revitalizing area”). The applicant must both show indicators of the changing economic character and identify the private investment or other activity that is linked to these changes. See the NOFO for more details on what qualifies as \"overriding housing need\" and how to prove an a revitalizing area. Provide your analysis in Tab I."]
[]
[]
[]
[]
[null,null,null,null,"Submissions Requirements"]
[null,null,null,null,{"$f":"INDEX(SNS[Output],MATCH(1,(M20=SNS[Tool])*(N20=SNS[Adjacent])*(O20=SNS[Sufficient])*(P20=SNS[Overriding - Rev Area])*(Q20=SNS[Overriding - Rev Strategy]),0))","v":"A certification from the applicant, based on local knowledge and any available local data, stating it has determined that the site is not in an area of minority concentration. Applicant must provide a description of its analyses and provide references for the data relied upon to support this conclusion.  "}]
[]
[]
[null,null,null,null,"Additional Comments"]

{"sheet":"1 Capacity","index":3,"n_rows":67,"n_cols":6,"rows_kept":67,"cut":false,"hidden":false,"merged":[[57,2,57,6],[2,2,2,5]]}
[]
[]
[null,null,"Rating Factor 1: Applicant Capacity (18 points)"]
[]
[null,null,{"$f":"IF('Toolkit Instructions'!D5=\"\",\"Enter Project Name on Instructions Tab\",CONCATENATE(\"Project Name: \",'Toolkit Instructions'!D5))","v":"Enter Project Name on Instructions Tab"}]
[]
[null,null,{"$f":"IF('Toolkit Instructions'!$D$7=\"\",\"Enter Project Sponsor on Instructions Tab\",CONCATENATE(\"Project Sponsor: \",'Toolkit Instructions'!$D$7))","v":"Enter Project Sponsor on Instructions Tab"}]
[]
[]
[]
[]
[]
[]
[]
[]
[]
[]
[]
[]
[]
[]
[]
[]
[]
[]
[]
[]
[null,null,"A. Development & Management Experience (13 points)"]
[]
[null,null,"1. Please list the entity that will serve as the property manager"]
[]
[null,null,"2. Please list the entity that will serve as the developer"]
[]
[null,null,"3. Please list any Section 202 awards that any part of the Development Team was awarded during the FY2018 or FY2020 Section 202 NOFOs. Include which organization/person on the development team, the project name, project location, and PRAC number."]
[]
[null,null,"4. How many elderly affordable housing properties have been placed in service within the last five years by the sponsor or development partner?","3+"]
[null,null,"4a. Provide a list of properties developed by the Sponsor that fit into the category above, including property name, property location, date units placed into service, number of units, type of development (i.e. new construction/acquisition of existing property)], and, if HUD-affiliated, the FHA and/or iREMS number as applicable."]
[]
[null,null," "]
[]
[]
[null,null,"5. Has the sponsor (or a co-developer) developed a Section 202 or Section 811 Capital Advance project? ","Yes and placed in service within 2 years of award"]
[null,null,"5a. Provide a list of properties developed by the Sponsor that fit into the category above, noting the year of the Capital Advance Award and the year the year the project was placed in service."]
[]
[]
[]
[null,null,"6. Will your application include the use of 4% or 9% credits? ","Yes"]
[]
[null,null,"7. How many years has the Development Team owned and operated elderly affordable housing?","6 to 9"]
[]
[null,null,"8. Does the Development Team have experience managing a PRAC-assisted property? ","Yes"]
[]
[null,null,null,0]
[]
[null,null,"9.  Describe your experience promoting Racial Equity. This may include, but is not limited to, describing your experience or resources to effectively meet the needs of underserved communities, particularly Black and Brown communities. Applicants must provide a copy of the response as an attachment in Tab I"]
[]
[]
[]
[null,null,"Rating Factor #1","Condition","Score","Possible Points"]
[null,null,"Capital Advance Delivery",{"$f":"D42","v":"Yes and placed in service within 2 years of award"},{"$f":"IF(D42=\"No\",0,IF(D42=\"Yes and placed in service within 3 years of award\",1,IF(D42=\"Yes and placed in service within 2 years of award\",2,0)))","v":2},2]
[null,null,"Elderly Affordable Housing Properties Placed in Service in Past 5 Years",{"$f":"D36","v":"3+"},{"$f":"IF(D36=0,0,IF(D36=1,1,IF(D36=2,3,IF(D36=\"3+\",5,0))))","v":5},5]
[null,null,"Years of Management and Operating Experience",{"$f":"D49","v":"6 to 9"},{"$f":"_xlfn.IFS(D49=0,0,D49=\"1 to 5\",1,D49=\"6 to 9\",3,D49=\"10+\",5)","v":3},5]
[null,null,"Management of Property Assisted via PRAC",{"$f":"D51","v":"Yes"},{"$f":"IF(AND(D63=\"Yes\",D53<>\"\"),1,IF(AND(D63=\"Yes\",ISBLANK(D53)),\"iREMS Needed\",0))","v":1},1]
[null,null,"Experience Promoting Racial Equity",null,"Pending HUD review",5]
[null,null,"Total",null,{"$f":"SUM(E60:E63)","v":11},{"$f":"SUM(F60:F64)","v":18}]
[]
[null,null,"Additional Comments"]

{"sheet":"2 Soundness of Approach","index":4,"n_rows":83,"n_cols":7,"rows_kept":83,"cut":false,"hidden":false,"merged":[]}
[]
[]
[null,null,"Rating Factor 2: Soundness of Approach (28 points)"]
[]
[null,null,{"$f":"IF('Toolkit Instructions'!D5=\"\",\"Enter Project Name on Instructions Tab\",CONCATENATE(\"Project Name: \",'Toolkit Instructions'!D5))","v":"Enter Project Name on Instructions Tab"}]
[]
[null,null,{"$f":"IF('Toolkit Instructions'!$D$7=\"\",\"Enter Project Sponsor on Instructions Tab\",CONCATENATE(\"Project Sponsor: \",'Toolkit Instructions'!$D$7))","v":"Enter Project Sponsor on Instructions Tab"}]
[]
[]
[]
[]
[]
[]
[]
[]
[]
[]
[]
[]
[]
[]
[]
[]
[]
[]
[]
[]
[]
[]
[null,null,"A. Neighborhood and Context"]
[null,null,"1. Did you submit site map and narrative under Tab C? ",null,null,null,"Yes"]
[]
[null,null,"2. Please briefly describe how residents will reasonably access critical amenities, particularly without the use of a personal motor vehicle. (e.g., walking, public transportation, shuttle, van service)"]
[]
[]
[]
[null,null,"3. Is the property located in an area that provides access to health care and social service facilities (e.g., senior center, licensed adult or senior care facility, hospital, medical clinic, or social service organization that offers services relevant to the elderly)?"]
[]
[]
[]
[]
[null,null,"4. Is the property located in an area that provides access to grocery stores or supermarkets selling produce and meat?"]
[]
[]
[]
[]
[null,null,"5. Is the property located in an area that provides access to parks and green space?"]
[]
[]
[]
[]
[null,null,"6. Is the property located in an area that provides access to recreational facilities (e.g., community or senior center, gym, health club, family entertainment venue, library)?"]
[]
[null,null,"Yes, within 1/2 mile walking distance or 30 minutes by public transportation or shuttle"]
[]
[null,null,"7. Is the property located in an area that provides access to other neighborhood amenities?"]
[]
[null,null,"Yes, within 1/2 mile walking distance or 30 minutes by public transportation or shuttle"]
[]
[]
[null,null,"B. Poverty Rate"]
[]
[]
[null,null,"1. Enter the Census Tract number of the tract your project is located in:"]
[]
[null,null,"2. According to 2020 ACS 5-year data, what is the estimated percent below poverty level in that census tract?",null,0.15]
[]
[]
[null,null,"C. Affirmatively Furthering Fair Housing."]
[null,null,"Explain how your proposed NOFO activities are aligned with requirements to Affirmatively Furthering Fair Housing (AFFH). Submit a copy of your response under Tab C."]
[]
[]
[null,null,"Rating Factor 2","Condition","Score","Possible Points"]
[null,null,"Grocery stores",{"$f":"C44","v":0},{"$f":"_xlfn.IFS($D74=\"Yes, within 1/4 mile walking distance or 15 minutes by public transportation or shuttle\",2,$D74=\"Yes, within 1/2 mile walking distance or 30 minutes by public transportation or shuttle\",1,$D74=\"No\",0,D74=0,0)","v":0},2]
[null,null,"Parks or green space",{"$f":"C49","v":0},{"$f":"_xlfn.IFS($D75=\"Yes, within 1/4 mile walking distance or 15 minutes by public transportation or shuttle\",2,$D75=\"Yes, within 1/2 mile walking distance or 30 minutes by public transportation or shuttle\",1,$D75=\"No\",0,D75=0,0)","v":0},2]
[null,null,"Recreational facilities",{"$f":"C54","v":"Yes, within 1/2 mile walking distance or 30 minutes by public transportation or shuttle"},{"$f":"_xlfn.IFS($D76=\"Yes, within 1/4 mile walking distance or 15 minutes by public transportation or shuttle\",2,$D76=\"Yes, within 1/2 mile walking distance or 30 minutes by public transportation or shuttle\",1,$D76=\"No\",0,D76=0,0)","v":1},2]
[null,null,"Healthcare and social services",{"$f":"C39","v":0},{"$f":"_xlfn.IFS($D77=\"Yes, within 1/4 mile walking distance or 15 minutes by public transportation or shuttle\",2,$D77=\"Yes, within 1/2 mile walking distance or 30 minutes by public transportation or shuttle\",1,$D77=\"No\",0,D77=0,0)","v":0},2]
[null,null,"Other neighborhood amenities",{"$f":"C58","v":"Yes, within 1/2 mile walking distance or 30 minutes by public transportation or shuttle"},{"$f":"_xlfn.IFS($D78=\"Yes, within 1/4 mile walking distance or 15 minutes by public transportation or shuttle\",2,$D78=\"Yes, within 1/2 mile walking distance or 30 minutes by public transportation or shuttle\",1,$D78=\"No\",0,D78=0,0)","v":1},2]
[null,null,"Poverty Rate",{"$f":"IF(ISBLANK(E66),\"–\",E66)","v":0.15},{"$f":"IF(AND(F66<=0.1,F66>0),4,IF(AND(F66>=0.1,F66<0.3),2,IF(F66>=0.3,0,0)))","v":0},4]
[null,null,"Affirmatively Furthering Fair Housing","Pending HUD review",null,5]
[null,null,"Sub total",null,{"$f":"SUM(E77,E74,E75,E76,E79,E78)","v":2},{"$f":"SUM(F74:F80)","v":19}]
[]
[null,null,"Additional Comments"]

{"sheet":"2.3 Land Use & Zoning","index":5,"n_rows":72,"n_cols":6,"rows_kept":72,"cut":false,"hidden":false,"merged":[[71,2,71,8],[2,2,2,8],[60,2,60,8],[4,2,4,8],[6,2,6,8],[47,2,54,2],[22,2,22,8],[62,3,62,8],[63,3,63,8],[64,3,64,8],[65,3,65,8],[35,2,43,2],[24,2,31,2],[58,3,58,4]]}
[]
[]
[null,null,"Rating Factor 2: Land Use / Zoning (9 points)"]
[]
[null,null,{"$f":"IF('Toolkit Instructions'!D5=\"\",\"Enter Project Name on Instructions Tab\",CONCATENATE(\"Project Name: \",'Toolkit Instructions'!D5))","v":"Enter Project Name on Instructions Tab"}]
[]
[null,null,{"$f":"IF('Toolkit Instructions'!$D$7=\"\",\"Enter Project Sponsor on Instructions Tab\",CONCATENATE(\"Project Sponsor: \",'Toolkit Instructions'!$D$7))","v":"Enter Project Sponsor on Instructions Tab"}]
[]
[]
[]
[]
[]
[]
[]
[]
[]
[]
[]
[]
[]
[]
[]
[null,null,"A. Land Use Factor Categories"]
[]
[null,null,"Fully Approved (9 points)"]
[]
[]
[]
[]
[]
[]
[]
[]
[]
[]
[null,null,"Partially Approved (4 points)"]
[]
[]
[]
[]
[]
[]
[]
[]
[]
[]
[]
[null,null,"Not Land Use Compliant (0 points)"]
[]
[]
[]
[]
[]
[]
[]
[]
[]
[]
[null,null,"1. Select Land Use Category","Fully Approved"]
[]
[null,null,"B. Evidence of Zoning / Land Use Permissions"]
[]
[null,null,"Item","Description of Evidence "]
[]
[]
[]
[]
[null,null,"Rating Factor #4","Condition","Score","Possible Points"]
[null,null,"Land Use / Zoning Approval",{"$f":"IF(D59<>\"\",D59,\"\")","v":"Fully Approved"},{"$f":"IF(D59<>\"\",_xlfn.IFS(D69=\"Not Land Use Compliant\",0,D69=\"Partially Approved\",4,D69=\"Fully Approved\",9),\"\")","v":9},9]
[]
[]
[null,null,"Additional Comments"]

{"sheet":"3 Leverage and Committed Funds","index":6,"n_rows":154,"n_cols":9,"rows_kept":154,"cut":false,"hidden":false,"merged":[[85,5,86,7],[2,2,2,7],[66,2,66,3],[75,6,75,7],[34,6,34,7],[41,2,41,3],[146,2,146,3],[135,2,135,3],[137,2,137,3],[139,2,139,3],[129,4,129,5],[131,4,131,5],[133,4,133,5],[112,2,113,2],[133,2,133,3],[121,5,121,7],[122,5,122,7],[127,3,127,7],[129,2,129,3],[131,2,131,3],[115,5,115,7],[116,5,116,7],[117,5,117,7],[118,5,118,7],[119,5,119,7]]}
[]
[]
[null,null,"Rating Factor 3: Project Leverage and Committed Funds"]
[]
[null,null,{"$f":"IF('Toolkit Instructions'!D5=\"\",\"Enter Project Name on Instructions Tab\",CONCATENATE(\"Project Name: \",'Toolkit Instructions'!D5))","v":"Enter Project Name on Instructions Tab"}]
[]
[null,null,{"$f":"IF('Toolkit Instructions'!$D$7=\"\",\"Enter Project Sponsor on Instructions Tab\",CONCATENATE(\"Project Sponsor: \",'Toolkit Instructions'!$D$7))","v":"Enter Project Sponsor on Instructions Tab"}]
[]
[]
[]
[]
[]
[]
[]
[]
[]
[null,null,null,null,null,null,null,null,"KT: change to 2022?"]
[]
[]
[]
[]
[]
[]
[]
[]
[]
[]
[]
[]
[]
[]
[]
[]
[]
[null,null,"A. Capital Advance Limit"]
[]
[null,null,"1. Are you proposing any intergenerational units? ","Yes"]
[]
[null,null,"Number of non-PRAC Units"]
[null,null,0]
[]
[null,null,"Number of PRAC Units (Excluding intergenerational)"]
[null,null,"0-BR",0]
[null,null,"1-BR",0]
[null,null,"2-BR",0]
[]
[null,null,"Number of PRAC Units (Intergenerational)",null,null,null,"Minimum Number of Intergenerational Units Required"]
[null,null,"2-BR",0,null,null,{"$f":"IF(D37=\"Yes\",IF((0.2*(SUM(D43:D50))>5),(ROUNDUP(0.2*(SUM(D43:D50)),0)),5),\"N/A - No Intergenerational Component Proposed\")","v":5},{"$f":"IF(D37=\"Yes\",IF(AND(G48=5,G48>(0.2*(SUM(D43:D50))),G48>SUM(D48:D50)),\"Error Check - Ensure Minimum Number of Intergenerational Units: the greater of 5 units or 20% of all PRAC units\",IF(AND(G48<>5,G50<0.2),\"Error Check - Ensure Minimum Number of Intergenerational Units\",\"\")))","v":"Error Check - Ensure Minimum Number of Intergenerational Units: the greater of 5 units or 20% of all PRAC units"}]
[null,null,"3-BR",0,null,null,"Intergenerational Units as % of total PRAC Units - as proposed"]
[null,null,"4-BR",0,null,null,{"$f":"IF(D37=\"Yes\",IFERROR((SUM(D48:D50)/SUM(D43:D50)),\"No Intergenerational Units Proposed\"),\"N/A\")","v":"No Intergenerational Units Proposed"}]
[null,null,null,null,null,null,"20% of all PRAC units - as proposed"]
[null,null,null,null,null,null,{"$f":"ROUNDUP(0.2*(SUM(D43:D50)),0)","v":0}]
[]
[]
[null,null,"Total Units"]
[null,null,{"$f":"SUM(C40,D43:D45,D48:D50)","v":0}]
[]
[null,null,"2. Select geography and building type"]
[]
[null,null,"ARKANSAS","<--- Project State"]
[]
[null,null,"TEXARKANA","<-- Project City"]
[]
[null,null,"Row House","<-- Building Type"]
[]
[]
[null,null,"TDC by Unit Type"]
[null,null,"0-BR",{"$f":"(INDEX('HUD 2023 TDC'!C:T,MATCH(1,('HUD 2023 TDC'!D:D='3 Leverage and Committed Funds'!$C$60)*('HUD 2023 TDC'!E:E='3 Leverage and Committed Funds'!$C$62)*('HUD 2023 TDC'!F:F='3 Leverage and Committed Funds'!$C$64),0),6))*(D43)","v":0}]
[null,null,"1-BR",{"$f":"(INDEX('HUD 2023 TDC'!C:T,MATCH(1,('HUD 2023 TDC'!D:D='3 Leverage and Committed Funds'!$C$60)*('HUD 2023 TDC'!E:E='3 Leverage and Committed Funds'!$C$62)*('HUD 2023 TDC'!F:F='3 Leverage and Committed Funds'!$C$64),0),8))*(D44)","v":0}]
[null,null,"2-BR",{"$f":"(INDEX('HUD 2023 TDC'!C:T,MATCH(1,('HUD 2023 TDC'!D:D='3 Leverage and Committed Funds'!$C$60)*('HUD 2023 TDC'!E:E='3 Leverage and Committed Funds'!$C$62)*('HUD 2023 TDC'!F:F='3 Leverage and Committed Funds'!$C$64),0),8))*D45+(INDEX('HUD 2023 TDC'!C:T,MATCH(1,('HUD 2023 TDC'!D:D='3 Leverage and Committed Funds'!$C$60)*('HUD 2023 TDC'!E:E='3 Leverage and Committed Funds'!$C$62)*('HUD 2023 TDC'!F:F='3 Leverage and Committed Funds'!$C$64),0),10))*D48","v":0},"Note: Except for intergenerational housing units, the maximum Capital Advance able to be requested for  2-BRs is equal to the 1-BR amount. Applicant is responsible for cost of excess of the 1-BR Capital Advance amount."]
[null,null,"3-BR",{"$f":"(INDEX('HUD 2023 TDC'!C:T,MATCH(1,('HUD 2023 TDC'!D:D='3 Leverage and Committed Funds'!$C$60)*('HUD 2023 TDC'!E:E='3 Leverage and Committed Funds'!$C$62)*('HUD 2023 TDC'!F:F='3 Leverage and Committed Funds'!$C$64),0),12))*(D49)","v":0}]
[null,null,"4-BR",{"$f":"(INDEX('HUD 2023 TDC'!C:T,MATCH(1,('HUD 2023 TDC'!D:D='3 Leverage and Committed Funds'!$C$60)*('HUD 2023 TDC'!E:E='3 Leverage and Committed Funds'!$C$62)*('HUD 2023 TDC'!F:F='3 Leverage and Committed Funds'!$C$64),0),14))*(D50)","v":0}]
[]
[null,null,"Project TDC Limit",{"$f":"SUM(D68,D69,D70)","v":0}]
[]
[null,null,"B. Commitment of Sources & Project Leverage (20 points)"]
[]
[null,null,"1. Are you a National Sponsor?",null,"No",{"$f":"_xlfn.IFS(AND(E78=\"No\",(0.005*E90<10000)),(0.005*E90),AND(E78=\"No\",(E90>10000)),10000,AND(E78=\"Yes\",E90>25000),25000,AND(E78=\"Yes\",E90<25000),0.005*E90)","v":0}]
[]
[null,null,"2. Was the land in the project donated or acquired below fair market value?",null,"Yes","    Remember: Land donations or seller financing must include a third-party appraisal or tax assessment to document value."]
[]
[null,null,{"$f":"IF(E80=\"Yes\", \"2a. Appraised fair market value of land:\", \"\")","v":"2a. Appraised fair market value of land:"}]
[]
[null,null,{"$f":"IF(E80=\"Yes\", \"2b. Price you paid for the land:\", \"\")","v":"2b. Price you paid for the land:"}]
[]
[null,null,"2c. Do you have a binding commitment for this land?",null,null,"Note: The donated value of land is considered when calculating the leverage ratio; if you have a binding commitment, the donated value is considered in calculating the committed funds ratio. "]
[]
[]
[null,null,"Ba. Sources","Description","Total ($)","Committed?","Submitted Evidence","Comments, including explanation for uncommitted funds"]
[null,null,"202 Capital Advance Requested",null,0,"No"]
[null,null,"Minimum Owner Equity",null,0]
[null,null,"Permanent Loan",null,0]
[null,null,"9% Federal LIHTC Equity",null,0,"No"]
[null,null,"4% Federal LIHTC Equity",null,0]
[null,null,"State LIHTC Equity",null,0]
[null,null,"Federal Historic Tax Credit Equity",null,0]
[null,null,"State/Local Historic Tax Credit Equity",null,0]
[null,null,"Seller Note",null,0]
[null,null,"Existing Reserves",null,0]
[null,null,"Federal Home Loan Bank AHP Grant",null,0]
[null,null,"Local Tax Incremented Financing (TIF)",null,0]
[null,null,"CDBG",null,0]
[null,null,"HOME",null,0]
[null,null,"Deferred Developer Fee",null,0]
[null,null,"Other ",null,0]
[null,null,"Other",null,0]
[null,null,"Other",null,0]
[null,null,"Total Sources ($):",null,{"$f":"(SUM(E90:E107))","v":0}]
[]
[null,null,"Surplus value of donated land:",{"$f":"IF(E80=\"Yes\",E82-E84,0)","v":0}]
[null,null,"Total committed funds:",{"$f":"IF(E86=\"Yes\",D110+(SUMIFS(E90:E107,F90:F107,\"Committed\")),(SUMIFS(E90:E107,F90:F107,\"Committed\")))","v":0},"Note: If \"Yes\" is selected for 2c, the surplus value of the donated land is added to this amount. "]
[null,null,"Total anticipated funds:",{"$f":"IF(E86=\"No\",D110+(SUMIFS(E90:E107,F90:F107,\"Anticipated\")),(SUMIFS(E90:E107,F90:F107,\"Anticipated\")))","v":0}]
[null,null,"(Sources + surplus land value) - Capital Advance:",{"$f":"E108+D110-E90","v":0}]
[]
[]
[null,null,"Bb. Uses",null,"Total ($)","Notes"]
[null,null,"Acquisition Costs"]
[null,null,"Hard Costs "]
[null,null,"Soft Costs"]
[null,null,"Development Fees"]
[null,null,"Reserves"]
[null,null,"Other"]
[null,null,"Total Uses ($):",null,{"$f":"ROUND(SUM(E117:E122),0)","v":0}]
[]
[null,null,"Gap between Sources and Uses",null,{"$f":"E108-E123","v":0},{"$f":"IF(E125<>0,\"Sources must equal uses. Please correct sources and uses above, and ensure all supporting documentation matches.\",\"\")","v":""}]
[]
[]
[null,null,"Bc. Additional Questions"]
[]
[null,null,"1. What is the name of the project's HEROS submission?"]
[]
[null,null,"2. What is the name of the individual who submitted the project's HEROS?"]
[]
[null,null,"3. What is the email address of the person who submitted the project's HEROS?"]
[]
[null,null,"4a. Did your environmental review require a clean up assessment?",null,"Choose one"]
[]
[null,null,"4b. Are mitigation costs included in the uses table above?"]
[]
[null,null,"4c. Please explain your response to 4b."]
[]
[]
[null,null,"5a. Does your proposal require relocation of current residents?",null,"Choose one"]
[]
[null,null,"5b. Are relocation costs included in the uses table above?"]
[]
[null,null,"5c. Please explain your response to 5b."]
[]
[]
[null,null,"Rating Factor #3",null,"Condition","Score","Possible Points"]
[null,null,"Project Leverage",null,{"$f":"IF(D113<>0,((D113/SUM(C40,D43:D45,D48:D50))/(E90/SUM(D43:D45,D48:D50))),0)","v":0},{"$f":"_xlfn.IFS(E151>=6,10,E151>=4,8,E151>=3,6,E151>=2,4,E151>=1,2,E151>=0.5,1,E151<=0.5,0)","v":0},10]
[null,null,"Commitment of Sources",null,{"$f":"IF((E108-E90)>0,(D111+(0.5*D112))/(D113),0)","v":0},{"$f":"(IF(E152>=0.9,10,IF(E152>=0.8,8,IF(E152>=0.7,6,IF(E152>=0.6,4,IF(E152>=0.5,2,0))))))","v":0},10]
[]
[null,null,"Additional Comments"]

{"sheet":"4 Supportive Services","index":7,"n_rows":50,"n_cols":12,"rows_kept":50,"cut":false,"hidden":false,"merged":[[49,2,49,9],[2,2,2,9],[18,2,18,6],[20,2,20,6],[32,2,32,6],[36,2,36,6],[30,2,31,6]]}
[]
[]
[null,null,"Rating Factor 4: Supportive Services (10 points)"]
[]
[null,null,{"$f":"IF('Toolkit Instructions'!D5=\"\",\"Enter Project Name on Instructions Tab\",CONCATENATE(\"Project Name: \",'Toolkit Instructions'!D5))","v":"Enter Project Name on Instructions Tab"}]
[]
[null,null,{"$f":"IF('Toolkit Instructions'!$D$7=\"\",\"Enter Project Sponsor on Instructions Tab\",CONCATENATE(\"Project Sponsor: \",'Toolkit Instructions'!$D$7))","v":"Enter Project Sponsor on Instructions Tab"}]
[]
[]
[]
[]
[]
[]
[]
[null,null,"A. Supportive Services Plan  "]
[]
[null,null,"1. Have you attached your services plan and any partner letters of support in Tab J? ",null,null,null,null,"No"]
[]
[null,null,"2. Does your services plan include support for Activities of Daily Living (ADLs)?",null,null,null,null,"No"]
[]
[null,null,"3. Does your services plan include support for Instrumental Activities of Daily Living (IADLs)?",null,null,null,null,"No"]
[]
[null,null,"4. Does your services plan address the social isolation of residents?",null,null,null,null,"No"]
[]
[null,null,"5. Does your services plan address the physical health of residents? ",null,null,null,null,"No"]
[]
[null,null,"6. Does your services plan identify a reliable, sustainable source of funding for proposed services?",null,null,null,null,"No"]
[]
[null,null,"7. How many years do you have implementing a comparable services plan? ",null,null,null,null,"None"]
[]
[null,null,"8. Does your services plan demonstrate evidence of improved resident outcomes from the provision of services (such as reducing hospitalization visits, reducing moves to assisted living or hospice-care facilities, increased tenant satisfaction, etc.)?",null,null,null,null,"Yes"]
[]
[null,null,"9. Does your services plan include other partners in service delivery (0.5 point total), and do those partners include state or local governments (1 point total)?",null,null,null,null,"No",null,null,null,"This pulls from List Validation"]
[]
[null,null,"10. Do you intend to include units for intergenerational caregivers in your project?",null,null,null,null,"No"]
[]
[null,null,"Make sure to fill out tab 6.Intergenerational in this toolkit describing intergenerational components of your project."]
[]
[null,null,null,null,"Supportive Services","Condition","Score","Possible Points"]
[null,null,null,null,"Support for ADLs",{"$f":"H19","v":"No"},{"$f":"IF(F40=\"Yes\",1,0)","v":0},1]
[null,null,null,null,"Support for IADLs",{"$f":"H21","v":"No"},{"$f":"IF(F41=\"Yes\",1, 0)","v":0},1]
[null,null,null,null,"Social Isolation",{"$f":"H23","v":"No"},{"$f":"IF(F42=\"Yes\",1, 0)","v":0},1]
[null,null,null,null,"Physical Health",{"$f":"H25","v":"No"},{"$f":"IF(F43=\"Yes\",1, 0)","v":0},1]
[null,null,null,null,"Reliable, Sustainable Source of Funding",{"$f":"H27","v":"No"},{"$f":"IF(F44=\"Yes\",1, 0)","v":0},1]
[null,null,null,null,"Experience",{"$f":"H29","v":"None"},{"$f":"IF(H29=\"0-3 years\",2,IF(H29=\"4-9 years\",4,IF(H29=\"10+ years\",6,0)))","v":0},6]
[null,null,null,null,"Evidence of Efficacy",{"$f":"H31","v":"Yes"},{"$f":"IF(F46=\"Yes\",1, 0)","v":1},1]
[null,null,null,null,"Partners",{"$f":"H33","v":"No"},{"$f":"_xlfn.IFS(F47=\"Yes, including state or local government\",1,F47=\"Yes, but no state or local government\",0.5,F47=\"No\",0,F47=0,0)","v":0},1]
[null,null,null,null,"Subtotal",null,{"$f":"IF(SUM(G40:G47)>10,\"10 Point Maximum Achieved\",SUM(G40:G47))","v":1},10,"Note: Any points beyond 10 will not be added to your score."]
[]
[null,null,"Additional Comments"]

{"sheet":"5 Physical Design","index":8,"n_rows":156,"n_cols":13,"rows_kept":156,"cut":false,"hidden":false,"merged":[[135,2,135,4],[102,2,102,4],[68,2,68,4],[2,2,2,7],[4,2,4,4],[6,2,6,4],[31,2,31,4],[79,2,79,4]]}
[]
[]
[null,null,"Rating Factor 5: Physical Design (24 points)"]
[]
[null,null,{"$f":"IF('Toolkit Instructions'!D5=\"\",\"Enter Project Name on Instructions Tab\",CONCATENATE(\"Project Name: \",'Toolkit Instructions'!D5))","v":"Enter Project Name on Instructions Tab"}]
[]
[null,null,{"$f":"IF('Toolkit Instructions'!$D$7=\"\",\"Enter Project Sponsor on Instructions Tab\",CONCATENATE(\"Project Sponsor: \",'Toolkit Instructions'!$D$7))","v":"Enter Project Sponsor on Instructions Tab"}]
[]
[]
[]
[]
[]
[]
[]
[]
[]
[]
[]
[]
[]
[]
[]
[]
[]
[]
[null,null,"Intergenerational Design"]
[]
[null,null,"1a. Are you proposing intergenerational housing units as part of this proposal?",null,null,"Yes"]
[]
[null,null,null,{"$f":"IF(F28=\"Yes\", \"Make sure to fill out tab 6. Intergenerational in this toolkit describing intergenerational components of your project\", \"\")","v":"Make sure to fill out tab 6. Intergenerational in this toolkit describing intergenerational components of your project"}]
[]
[null,null,"A. Required Building Design Components (No Score)"]
[null,null,"Applicant acknowledges compliance with all applicable requirements cited below"]
[null,null,"#","Points","Criterion Description","Compliant?","Note","Explanation, if \"N/A\" is selected"]
[null,null,"A.1","N/A","Resident units limited to 0-BR and 1-BR units. 2-BR only allowed if either intergenerational units, proposed for a resident manager, or financed by other sources and excess square footage is treated as an amenity as outlined in 24 CFR 891.210","N/A",{"$f":"IF(F35=\"N/A\", \"Explain in next column\", \"\")","v":"Explain in next column"},"Enter Text here",null,null,null,null,"you cannot put the comment in the field you want the user to overwrite with an explanation. I feel that the explanation text is not necessary but have included a note column G that provides the instruction"]
[null,null,"A.2","N/A","Building design complies with FHA's Minimum Property Standards set forth in 24 CFR 200, sub-part S","Choose one","","Enter Text here"]
[null,null,"A.3","N/A","Must meet all applicable federal accessibility standards:  1) Uniform Federal Accessibility Standards (UFAS) under 24 CFR 40.7 or HUD Alternative Standards in 79 Fed. Reg. 29671; 2) Section 504 of the Rehab Act of 1973 and implementing regulations at 28 CFR Part 8; 3)Titles II and Title III of the ADA as applicable and implementing regulations at 28 CFR 35 and 36; 4) For New Construction  - the Fair Housing Act and implementing regulations at 24 CFR 100","Choose one","","Enter Text here"]
[null,null,"A.4","N/A","Restrictions on use of capital advance funds set forth in 24 CFR 891.120c","Choose one","","Enter Text here"]
[null,null,"A.5","N/A","Smoke Detector installation in accordance with 24 CFR 891.120d","Choose one","","Enter Text here"]
[null,null,"A.6","N/A","Energy and Water Conservation. Unless the project will achieve one of the green standards that would justify rating points (see section F), the project must meet the following requirements: \n•\tAll buildings proposed for new construction or gut rehabilitation (total removal and replacement of a building's\n\"guts,\" leaving just the exterior shell of the building) must meet or exceed the 2021 International Energy Conservation Code (IECC) for single family or low-rise multifamily properties (three stories or less) or the ASHRAE 90.1-2019 standard for mid to high-rise multifamily projects.\n•\tAll buildings involving rehabilitation must utilize Energy Star®, WaterSense® or Federal Energy Management Program (FEMP)-designated products and appliances replacements, if any such designation is available for the applicable system or appliance.","Yes","","Enter Text here"]
[null,null,"A.7","N/A","Commercial Facilities allowed in accordance with Title III of the ADA and in regulation 24 CFR 891.120e   and 28 CFR 36","Yes","","Enter Text here"]
[null,null,"A.8","N/A","New construction/substantial rehab should include broadband infrastructure in accordance with 24 CFR 5.100","Yes","","Enter Text here"]
[null,null,"A.9","N/A","Primary entrances to the building from parking areas, drop-off zones, or principal pedestrian routes include accessible ramps and doorways with flush thresholds or minimal beveled door transition.  There must be a passenger drop-off zone and the exterior route from the building entrance to the drop-off zone must have a handrail.  Secondary doors and thresholds for exterior decks, patios, etc., shall have beveled door transitions appropriate for access in a wheelchair (e.g., beveled door transitions of no greater than ½ inch)","Yes","","Enter Text here"]
[null,null,"A.10","N/A","Waiting area with seating that has a clear line of sight to the exterior passenger pick-up/drop-off location","Yes","","Enter Text here"]
[null,null,"A.11","N/A","Public space doorways with a minimum width of 36 inches and common area hallways with a minimum width of 60 inches to accommodate use of mobility aides and easy navigation","Yes","","Enter Text here"]
[null,null,"A.12","N/A","Project includes spaces designed to facilitate social interaction, such as a lobby or common living room with seating","Yes","","Enter Text here"]
[null,null,"A.13","N/A","A resident services office to support staffing of resident service coordination, visiting health care professionals, or community services, which offices must ensure resident privacy and be of adequate size to accommodate the resident, a family member/support person, and the professional","Yes","","Enter Text here"]
[null,null,"A.14","N/A","Well-lit signage with large lettering with building information for easy navigation (for visitors and residents) and unique features (e.g. colors) for each floor or wing of the building to aid in way-finding","Yes","","Enter Text here"]
[null,null,"A.15","N/A","Central heating and cooling systems throughout the building (including apartments).  Projects in markets where market-rate senior housing commonly excludes air conditioning may install central heating only","Yes","","Enter Text here"]
[null,null,"A.16","N/A","In-building or in-unit laundry facilities (not just hookups) with front loading equipment","Yes","","Enter Text here"]
[null,null,"A.17","N/A","Within-unit doors between rooms (but not necessarily doors to utility closets or non-walk-in storage space) with a minimum width of 32 inches","Yes","","Enter Text here"]
[null,null,"A.18","N/A","Lever door handles or other accessible hardware where hand-gripping is not required (not knobs)","Yes","","Enter Text here"]
[null,null,"A.19","N/A","Door handles mounted no higher than 48 inches from floor","Yes","","Enter Text here"]
[null,null,"A.20","N/A","D or U shaped handles (not knobs) on all cabinetry","Yes","","Enter Text here"]
[null,null,"A.21","N/A","Faucets with lever handles in bathroom and kitchen","Yes","","Enter Text here"]
[null,null,"A.22","N/A","Anti-scald valves on fixtures","Yes","","Enter Text here"]
[null,null,"A.23","N/A","Slip-resistant flooring in bathrooms and kitchens","Yes","","Enter Text here"]
[null,null,"A.24","N/A","Pre-installed Section 504 or ADA compliant grab bars in the showers and next to all toilets","Yes","","Enter Text here"]
[null,null,"A.25","N/A","Lighting in shower areas","Yes","","Enter Text here"]
[null,null,"A.26","N/A","Emergency call system in each unit","Yes","","Enter Text here"]
[null,null,"A.27","N/A","Area inside the entrance door to all units with a 60-inch diameter circular turning radius to permit maneuvering with a wheelchair or storage for walkers, scooters or other mobility devices.","Yes","","Enter Text here"]
[null,null,"A.28","N/A","All bathroom sinks accommodate seated residents, with counter heights between 30 and 34 inches off the floor and either wall-hung sinks and cabinetry which is not under the sink or removable base cabinets under the sink. ","Yes","","Enter Text here"]
[null,null,"A.29","N/A","Continuous flooring under sink areas to avoid need for new flooring if cabinets need to be removed at a later date to accommodate resident mobility.","Yes","","Enter Text here",null,null,null,null,{"$f":"COUNTIF((F35:F63), \"No\") + COUNTIF((F35:F63), \"Choose one\")","v":4}]
[null,null,null,null,"Design Improvements Met? ",null,null,{"$f":"IF((COUNTIF((F35:F63), \"No\") + COUNTIF((F35:F63), \"Choose one\") > 0), \"No\", \"Yes\")","v":"No"},null,null,null,null,"I have rewritten the COUNTIF formula so that \"Choose one\" effectively counts as a \"No\" in the calculation."]
[]
[null,null,"Optional Building Design Rating Factor Points (24 Points)"]
[null,null,"A maximum of 20 points are available in this section. Sections B, C, D, and E have minimum point requirements that must be met."]
[]
[null,null,"B. Design Elements: Fall Prevention (minimum 2 points)"]
[null,null,"#","Points","Criterion Description","Included?","Note","Description if \"Yes\" is selected"]
[null,null,"B.1",0.5,"Hand railings on both sides of building hallways. Handrails should be installed 34” to 38” above stair treads or floor; low handrails should be placed at 27” maximum. Handrails should be 1 ¼” to 2” in diameter with a slip-resistant surface for a secure grip.  ","Yes",{"$f":"IF(F71=\"Yes\",\"Describe improvement in next column\",\"\")","v":"Describe improvement in next column"},"Enter text here"]
[null,null,"B.2",0.5,"Smooth, hard, durable, slip-resistant flooring material or easy to clean short- pile carpets to reduce tripping and support residents who shuffle feet. If installing carpet, use a tight-looped version with a low profile (up to 1/2” high) and a thin pad (10-pound density) or no pad, and attach securely to the floor beneath with a direct glue-down application. ","Yes","Describe improvement in next column","Enter text here"]
[null,null,"B.3",0.5,"Shelving to place bags and packages at all locked entrances (including building entrances and unit entrances), with lighting to see the door lock.","Yes","Describe improvement in next column","Enter text here"]
[null,null,"B.4",0.5,"Hallway light fixtures with output of at least 2700 lumens and fixtures that cast a diffuse light (reflected illumination on the wall or ceiling via a shade, not direct light).","Choose one","","Enter text here"]
[null,null,"B.5",0.5,"Open, inviting stairs near the elevator with low-rise steps (a rise between 6 and 7 inches and a tread depth between 11 and 13 inches). The stairs are made of non-slip materials, have strong lighting, contrasting riser and tread colors, hand railings that extend 12 inches beyond the top and bottom of each run of steps, and no more than 4 feet in rise between landings that turn direction at each landing to lessen the distance of a fall.","Choose one","","Enter text here"]
[null,null,"B.6",0.5,"Color contrast counters with the floor or grab bar colors relative to wall or tile to enhance the ability to see where the counter edge and/or grab bar begins and ends.","Choose one","","Enter text here"]
[null,null,null,null,"Fall Prevention Subtotal",null,null,{"$f":"COUNTIF(F71:F76, \"YES\")*0.5","v":1.5}]
[]
[]
[null,null,"C. Design Elements: Universal Design & Visitability (minimum 2 points)"]
[null,null,"#","Points","Criterion Description","Included?","Note","Description if \"Yes\" is selected"]
[null,null,"C.1",0.5,"Awning windows with easy-use crank hardware.","Yes",{"$f":"IF(F82=\"Yes\",\"Describe improvement in next column.\",\"\")","v":"Describe improvement in next column."},"Enter text here"]
[null,null,"C.2",0.5,"Rocker-pad light switches with internal locator lights.","Choose one","","Enter text here"]
[null,null,"C.3",0.5,"Peephole at sitting level: Peepholes in the doors of individual units installed at about 43” to accommodate seated residents. ","Choose one","","Enter text here"]
[null,null,"C.4",0.5,"Materials for ceilings and other hard surfaces that dampen background noise (like synthetic tiles, melamine foams, fiberglass, wood, and plastic).","Choose one","","Enter text here"]
[null,null,"C.5",0.5,"Task lighting (providing for increased light for specific tasks in a room that may already have some ambient light) on counter areas in the kitchen and bathrooms.","Choose one","","Enter text here"]
[null,null,"C.6",0.5,"Hand-held shower wand (with controls) with hook that can be reached from seated position in 100% of PRAC units. ","Choose one","","Enter text here"]
[null,null,"C.7",0.5,"Comfort height toilet (approximately 18 inches high) in baths of 100% of PRAC units.","Choose one","","Enter text here"]
[null,null,"C.8",0.5,"Electric stoves in kitchens for easy and flexible decommissioning for residents with dementia in 100% of PRAC units.","Choose one","","Enter text here"]
[null,null,"C.9",0.5,"Side by side refrigerator/freezer or freezer on the bottom in kitchens in 100% of PRAC units.","Choose one","","Enter text here"]
[null,null,"C.10",1,"Open floor plans and bedroom and living room sizes not less than 10 feet by 10 feet to permit flexibility in placement of furniture and to allow wheelchair or walker circulation. ","Choose one","","Enter text here"]
[null,null,"C.11",1,"Hallways with a clear width in excess of 42 inches. ","Choose one","","Enter text here"]
[null,null,"C.12",1,"Power operated doors, driven by either an easy-push button or by a motion proximity sensor.","Choose one","","Enter text here"]
[null,null,"C.13",1,"If there are floors without at-grade entrances, more than one elevator of at least 24” x 84” (to accommodate a stretcher) to ensure back up during repairs. ","Choose one","","Enter text here"]
[null,null,"C.14","0.5 for at least 50% of PRAC units; 1 for 100% of PRAC units. ","Section 504 specified turning and access-to-fixtures requirements in baths and kitchens. ","Choose one",{"$f":"IF(F95<>\"Choose one\",\"Describe improvement in next column.\",\"\")","v":""},"Enter text here"]
[null,null,"C.15","0.5 for at least 50% of PRAC units; 1 for 100% of PRAC units. ","Showers in apartments (no tubs) with curbless entry, sloped to minimize splash outside the shower, and no smaller than 36” x 60” to accommodate resident plus caregiver or mobility device.  ","Choose one",{"$f":"IF(F96<>\"Choose one\",\"Describe improvement in next column.\",\"\")","v":""},"Enter text here"]
[null,null,"C.16","0.5 for at least 50% of PRAC units; 1 for 100% of PRAC units. ","Separate cook top and wall oven with front-facing controls, in kitchens, with wall ovens located at counter height adjacent to 18 linear inches of counter space with side-mounted hinges on the wall oven opening on the side which does not obstruct easy transfer from oven to counter.  ","Choose one",{"$f":"IF(F97<>\"Choose one\",\"Describe improvement in next column.\",\"\")","v":""},"Enter text here"]
[null,null,"C.17","0.5 for at least 50% of PRAC units; 1 for 100% of PRAC units. ","Cabinets in kitchens designed for easy reach, which can include any of the following: cabinets next to (rather than over) counters, over-counter cabinet mounts beginning approximately 13 inches above the countertop, under-counter cabinets having sliding shelves, and corner cabinets having a “lazy Susan”","Choose one",{"$f":"IF(F98<>\"Choose one\",\"Describe improvement in next column.\",\"\")","v":""},"Enter text here"]
[null,null,"C.18","0.5 for at least 50% of PRAC units; 1 for 100% of PRAC units. ","In kitchens, removable base cabinets under the kitchen sink, cook top and a portion of the workspaces in order to accommodate seated residents.","Choose one",{"$f":"IF(F99<>\"Choose one\",\"Describe improvement in next column.\",\"\")","v":""},"Enter text here"]
[null,null,null,null,"Universal Design Subtotal",null,null,{"$f":"(COUNTIF($F82:$F90,\"YES\")*0.5)+COUNTIF($F91:$F94,\"YES\")*1+COUNTIF($F95:$F99,\"Yes at least 100%\")*1+COUNTIF($F95:$F99,\"Yes at least 50%\")*0.5","v":0.5}]
[]
[]
[null,null,"D. Design Elements: Technology (minimum 1 point)"]
[null,null," #","Points","Criterion Description","Included?","Note","Description if \"Yes\" is selected"]
[null,null,"D.1",0.5,"Wireless door locks with fob.","Yes",{"$f":"IF(F105=\"Yes\",\"Describe improvement in next column.\",\"\")","v":"Describe improvement in next column."},"Enter text here"]
[null,null,"D.2",0.5,"Wireless door chime with flashing strobe light in all units. ","Choose one","","Enter text here"]
[null,null,"D.3",0.5,"Building is constructed to provide adequate space for wiring of MDF/IDF cable racks on each floor to accommodate current and future router needs for staff, service providers, and residents. Building also has sufficient routers to provide seamless connection from common spaces to apartments for assistive technology and for staff use of remote technology to manage tenant records, work orders, etc. when in an apartment. ","Choose one","","Enter text here"]
[null,null,"D.4",0.5,"Video intercom system at main entry which connects to in-unit features so that seniors can easily visually identify visitors when allowing them access to the building.  The system should have large push button controls for ease of use by seniors, particularly seniors with arthritis or other challenges that make it hard to use a touchscreen.","Choose one","","Enter text here"]
[null,null,"D.5",0.5,"In-unit control of unit temperature, through simple to understand HVAC controls with large screens for easy reading.","Choose one","","Enter text here"]
[null,null,"D.6",0.5,"Upgraded emergency call systems in each unit to allow 2-way communication. ","Choose one","","Enter text here"]
[null,null,"D.7",1,"Provide residents free open access to building Wi-Fi and internet in their apartments. Note: Monthly service charges are not an eligible PRAC expense.","Choose one","","Enter text here"]
[null,null,null,null,"Technology Subtotal",null,null,{"$f":"COUNTIF($F105:$F110, \"YES\")*0.5+COUNTIF($F111,\"Yes\")*1","v":0.5}]
[]
[]
[null,null,"E. Design Elements: Health and Wellness (minimum 2 points)"]
[null,null," #","Points","Criterion Description","Included?","Note","Description if \"Yes\" is selected"]
[null,null,"E.1",0.5,"Fitness room and/or wellness room. ","Yes",{"$f":"IF(F117=\"Yes\",\"Describe improvement in next column.\",\"\")","v":"Describe improvement in next column."}]
[null,null,"E.2",0.5,"Dedicated gardening areas for resident use with elevated garden plots.","Choose one",""]
[null,null,"E.3",0.5,"Well-lit, landscaped grounds with accessible, paved walking trails that encourage walking and other outdoor physical activity and with shaded exterior social spaces. (Applicants must provide sufficient detail through narrative or reference to schematics to justify points.)","Choose one",""]
[null,null,"E.4",0.5,"Periodic seating alcoves or built in seating nodes along (but not blocking) circulation routes for resting and socializing.","Choose one",""]
[null,null,"E.5",0.5,"Strobe light smoke and carbon monoxide detectors in all units.","Choose one",""]
[null,null,"E.6",1,"Resident services office(s) to support staffing of resident service coordination, visiting health care professionals, or community services beyond the minimum required, with the ability for each provider to lock supplies, personally identifiable information about residents, and other materials necessary for the provider to offer robust and confidential resident services on-site, and with a hand-wash sink. ","Choose one",""]
[null,null,"E.7",1,"Building provides easy access from building entries to prominent off-site features (e.g., bus stops). Easy access routes do not require shortcuts through landscaping, or walking through alleys, and parking lots. Passenger loading zone does not qualify as parking lots. (Applicants must provide sufficient detail through narrative or reference to schematics to justify a rating factor point)","Choose one",""]
[null,null,"E.8",1,"Multi-purpose community room (in addition to the required lobby or common room) of no less than 250 square feet and no less than 5 square feet per unit (which, in larger buildings, could be multiple rooms) with stackable furniture, storage, good lighting and acoustics and fully or partially transparent walls so activities are visible to encourage participation.","Choose one",""]
[null,null,null,null,"Health & Wellness Subtotal",null,null,{"$f":"COUNTIF($F117:$F121,\"YES\")*0.5+COUNTIF($F122:$F124,\"Yes\")*1","v":0.5}]
[]
[]
[null,null,"F. Design Elements: Resource Efficiency and Climate Resilience"]
[null,null," #","Points","Criterion Description","Included?","Note","Description if \"Yes\" is selected"]
[null,null,"F.1","2 to 4","For new construction / gut rehabilitation projects: design to a green standard above the base requirements.\n- 2 Points: DOE Zero Energy Ready Home, National Green Building Standard 2020: Silver + at least one badge (net zero energy, zero water, resilience), National Green Building Standard 2020: Gold, LEED v4.1: Silver, Gold, or Platinum, Enterprise Green Communities Plus, GreenPoint New Home Multifamily: Gold, EarthCraft Multifamily: Platinum \n- 4 Points: National Green Building Standard 2020: Silver + net zero energy + zero water or resilience badge, National Green Building Standard 2020: Emerald, LEED v4.1: Zero Energy or Zero Carbon , Passive House (PHIUS+), Living Building Challenge (any certification) \n\nFor rehabilitation projects: design to a green standard. \n- 2 Points: National Green Building Standard 2020, Enterprise Green Communities, LEED v4.1 Operations + Maintenance, GreenPoint Existing Home Multifamily Elements, EarthCraft Multifamily Renovation, Green Globes Multifamily for Existing Buildings\n- 4 Points: National Green Building Standard 2020: Silver + at least one badge, National Green Building Standard 2020: Gold, National Green Building Standard 2020: Emerald, LEED v4.1 Operations + Maintenance: Gold or Emerald, Enterprise Green Communities Plus, GreenPoint Existing Home Multifamily Whole Building, Passive House (PHIUS+), Living Building Challenge (any certification) ","Yes 2 points",{"$f":"IF(OR(F130=\"Yes 2 points\", F130=\"Yes 4 points\"),\"Describe improvement in next column.\",\"\")","v":"Describe improvement in next column."}]
[null,null,"F.2",1,"Back-up generator to cover critical loads during power outage: elevator access, air temperature control, and refrigeration (for medications) and wiring to ensure critical features (such as refrigerators) can be connected to the generator without extension cords. Back-up power source should be sized to provide power to critical loads for at least five days.","Choose one",{"$f":"IF(F131=\"Yes\",\"Describe improvement in next column.\",\"\")","v":""}]
[null,null,"F.3",1,"Design building to rely only on electricity (no gas).","Choose one",{"$f":"IF(F132=\"Yes\",\"Describe improvement in next column.\",\"\")","v":""}]
[null,null,"F.4","0.5 to 1","Incorporate building design features to enhance the building’s climate resilience. Strategies will be assessed based on:  \n-Whether they address the highest Hazard Type Risk Ratings in the property’s NRI report \n\nAND either:  \n- Whether the design feature maintains life-critical systems (food, water, electricity, etc.); or \n- Whether the design feature supports safe shelter-in-place and/or full-building functional recovery \n\nEach feature that meets criteria a) and either b) or c) above will be worth 0.5 point, for up to 1 total point across climate resilient design features. Explain how your strategies meet these criteria in Tab K. \n\nPotential strategies include (but are not limited to): community rooms designed for safe and healthy shelter-in-place, floodproofing, fire resistant building designs, landscaped berms for hurricanes, FORTIFIED certification, tornado shelters","Choose one",{"$f":"IF(OR(F133=\"Yes 1 point\", F133=\"Yes 0.5 point\"),\"Describe improvement in next column.\",\"\")","v":""}]
[null,null,null,null,"Efficiency & Resilience Subtotal",null,null,{"$f":"COUNTIF($F131:$F132,\"Yes\")*1+COUNTIF($F130,\"Yes 2 points\")*2+COUNTIF($F130,\"Yes 4 points\")*4+COUNTIF($F133,\"Yes 1 point\")*1+COUNTIF($F133,\"Yes 0.5 point\")*0.5","v":2}]
[]
[null,null,"E. Design Elements: Physical Design (maximum 4 points)"]
[null,null,"Describe additional impactful building features designed to extend the period residents can live independently and age in place.  \nPlease provide a copy of documentation under Tab K."]
[]
[]
[]
[]
[null,null,null,null,"Physical Design Checklist","Score"]
[null,null,null,null,"Required Building Design Components Met",{"$f":"$H64","v":"No"}]
[null,null,null,null,"Category Minimums Met?",{"$f":"IF(AND($F146>=2,$F147>=2,$F148>=1,$F149>=2),\"YES\",\"NO\")","v":"YES"},{"$f":"IF(F144=\"NO\", \"Ensure minimum scores are met in Sections B,C,D, and E\",\"\")","v":""}]
[]
[null,null,null,null,"Fall Prevention (minimum 2 points)",3]
[null,null,null,null,"Universal Design (minimum 2 points)",13.5]
[null,null,null,null,"Technology (minimum 1 point)",3.5]
[null,null,null,null,"Health and Wellness (minimum 2 points)",5.5]
[null,null,null,null,"Resource Efficiency and Climate Resilience",7]
[null,null,null,null,"Subtotal",{"$f":"IF(SUM(F146:F150)>=20,\"20 Point Maximum Achieved\",SUM(F146:F150))","v":"20 Point Maximum Achieved"}]
[]
[null,null,null,null,"Physical Design Narrative","Score"]
[null,null,null,null,"  Narrative on Innovative Design Features","Up to 4 points, pending HUD review"]
[]
[null,null,"Additional Comments"]

{"sheet":"5a.Operating Cost Standard","index":9,"n_rows":70,"n_cols":12,"rows_kept":70,"cut":false,"hidden":false,"merged":[[2,2,2,11],[40,3,40,11],[53,3,53,8],[27,3,27,5],[31,3,31,5],[37,4,37,5],[29,3,29,4]]}
[]
[]
[null,null,"5a. Operating Cost Standard (OCS)"]
[]
[null,null,{"$f":"IF('Toolkit Instructions'!D5=\"\",\"Enter Project Name on Instructions Tab\",CONCATENATE(\"Project Name: \",'Toolkit Instructions'!D5))","v":"Enter Project Name on Instructions Tab"}]
[]
[null,null,{"$f":"IF('Toolkit Instructions'!$D$7=\"\",\"Enter Project Sponsor on Instructions Tab\",CONCATENATE(\"Project Sponsor: \",'Toolkit Instructions'!$D$7))","v":"Enter Project Sponsor on Instructions Tab"}]
[]
[]
[]
[]
[]
[]
[]
[]
[]
[]
[]
[]
[]
[]
[]
[]
[]
[]
[]
[]
[null,null,null,"A.Total Units Developed"]
[]
[null,null,null,"1. Total Number of Units Developed",null,0,{"$f":"IF(AND(('5a.Operating Cost Standard'!F30='5a.Operating Cost Standard'!E66),('5a.Operating Cost Standard'!F30='3 Leverage and Committed Funds'!C56),('5a.Operating Cost Standard'!E66='3 Leverage and Committed Funds'!C56)),\"\",\"Note: Value must match sum of total units in Sections C and D, as well as total unit count in 3b.Leverage and Committed Funds. Please go back and ensure all unit counts are consistent.\")","v":""}]
[]
[null,null,null,"B. Operating Cost Standard (OCS) Look Up"]
[]
[null,null,null,"1. Select State or MSA",null,"State Cost Standard"]
[]
[null,null,null,"2. Select Geography",null,"Georgia"]
[]
[]
[null,null,null,"OCS per Unit per Month",null,{"$f":"IF(F36<>\"\",(VLOOKUP(F36,'HUD 2022 Operating Cost Std'!A2:B254,2,FALSE))/12,0)","v":570.65183132243067},"* Note: The OCS includes $15 PUPM for service expenses."]
[]
[null,null,null,"C. PRAC Gross Potential Rent Summary (Cost Standard + Project Paid Utility Allowance)"]
[null,null,"Intergenerational units?","Unit Type\n(e.g. 1-BR)\n(a)","Number of Units\n(b)","Square Feet per Unit\n(c)","Total Square Footage\n","Monthly OCS","Monthly Owner-Paid Utilities\n(d)","Monthly Tenant-Paid Utilities (e)","Monthly Revenue"," Annual Rent by Unit Type "]
[null,null,null,"0-BR",null,null,{"$f":"E43*F43","v":0},{"$f":"IF(E43<>\"\",IF(AND(C43=\"Yes\",D43=\"2-BR\"),($F$39*1.15),IF(AND(C43=\"Yes\",D43=\"3-BR\"),($F$39*1.3225),IF(AND(C43=\"Yes\",D43=\"4-BR\"),($F$39*1.520875),$F$39))),0)","v":0},125,0,{"$f":"H43+I43","v":125},{"$f":"IF($F$39<>\"\",(K43)*12*E43,\"\")","v":0}]
[null,null,null,null,null,null,0,{"$f":"IF(E44<>\"\",IF(AND(C44=\"Yes\",D44=\"2-BR\"),($F$39*1.15),IF(AND(C44=\"Yes\",D44=\"3-BR\"),($F$39*1.3225),IF(AND(C44=\"Yes\",D44=\"4-BR\"),($F$39*1.520875),$F$39))),0)","v":0},0,0,{"$f":"H44+I44","v":0},0]
[null,null,null,null,null,null,0,{"$f":"IF(E45<>\"\",IF(AND(C45=\"Yes\",D45=\"2-BR\"),($F$39*1.15),IF(AND(C45=\"Yes\",D45=\"3-BR\"),($F$39*1.3225),IF(AND(C45=\"Yes\",D45=\"4-BR\"),($F$39*1.520875),$F$39))),0)","v":0},0,0,0,0]
[null,null,null,null,null,null,0,{"$f":"IF(E46<>\"\",IF(AND(C46=\"Yes\",D46=\"2-BR\"),($F$39*1.15),IF(AND(C46=\"Yes\",D46=\"3-BR\"),($F$39*1.3225),IF(AND(C46=\"Yes\",D46=\"4-BR\"),($F$39*1.520875),F39))),0)","v":0},0,0,0,0]
[null,null,null,null,null,null,0,{"$f":"IF(E47<>\"\",IF(AND(C47=\"Yes\",D47=\"2-BR\"),($F$39*1.15),IF(AND(C47=\"Yes\",D47=\"3-BR\"),($F$39*1.3225),IF(AND(C47=\"Yes\",D47=\"4-BR\"),($F$39*1.520875),F39))),0)","v":0},0,0,0,0]
[null,null,null,null,null,null,0,{"$f":"IF(E48<>\"\",IF(AND(C48=\"Yes\",D48=\"2-BR\"),($F$39*1.15),IF(AND(C48=\"Yes\",D48=\"3-BR\"),($F$39*1.3225),IF(AND(C48=\"Yes\",D48=\"4-BR\"),($F$39*1.520875),F39))),0)","v":0},0,0,0,0]
[null,null,null,null,null,null,0,{"$f":"IF(E49<>\"\",IF(AND(C49=\"Yes\",D49=\"2-BR\"),($F$39*1.15),IF(AND(C49=\"Yes\",D49=\"3-BR\"),($F$39*1.3225),IF(AND(C49=\"Yes\",D49=\"4-BR\"),($F$39*1.520875),F39))),0)","v":0},0,0,0,0]
[]
[null,null,null,"PRAC Units:",{"$f":"SUM(E43:E49)","v":0},null,null,null,"Annual Rental Income for PRAC:",null,null,{"$f":"SUM(L43:L49)","v":0}]
[null,null,null,null,null,null,"+"]
[]
[null,null,null,"D. Non-PRAC Gross Potential Rent Summary"]
[null,null,null,"Unit Type\n(e.g. 1-BR)\n(a)","Number of Units\n(b)","Square Feet per Unit\n(c)","Total Square Footage","Monthly Rent \n(d)","Annual Rent by Unit Type"]
[null,null,null,null,null,null,{"$f":"E56*F56","v":0},0,{"$f":"(E56*H56)*12","v":0}]
[null,null,null,null,null,null,0,0,0]
[null,null,null,null,null,null,0,0,0]
[null,null,null,null,null,null,0,0,0]
[null,null,null,null,null,null,0,0,0]
[null,null,null,null,null,null,0,0,0]
[null,null,null,null,null,null,0,0,0]
[]
[null,null,null,"Non-PRAC Units:",{"$f":"SUM(E56:E62)","v":0},null,"Annual Rental Income for Non-PRAC:",null,{"$f":"SUM(I56:I62)","v":0}]
[]
[null,null,null,"Total Units:",{"$f":"SUM(E64,E51)","v":0},{"$f":"IF(AND(('5a.Operating Cost Standard'!F30='5a.Operating Cost Standard'!E66),('5a.Operating Cost Standard'!F30='3 Leverage and Committed Funds'!C56),('5a.Operating Cost Standard'!E66='3 Leverage and Committed Funds'!C56)),\"\",\"Note: Value must match sum of total units in Section A, as well as total unit count in 3b.Leverage and Committed Funds. Please go back and ensure all unit counts are consistent.\")","v":""}]
[]
[null,null,null,"Total Gross Potential Rent:",null,{"$f":"SUM(I64,L51)","v":0}]
[]
[null,null,null,"Additional Comments"]

{"sheet":"5b. Operating Pro Forma","index":10,"n_rows":111,"n_cols":26,"rows_kept":111,"cut":false,"hidden":false,"merged":[[110,2,110,8],[75,2,76,3],[80,2,81,5],[2,2,2,25],[40,2,40,5],[51,2,51,5],[53,5,53,6],[43,7,51,8]]}
[]
[]
[null,null,"5b: Operating Pro Forma"]
[]
[null,null,{"$f":"IF('Toolkit Instructions'!D5=\"\",\"Enter Project Name on Instructions Tab\",CONCATENATE(\"Project Name: \",'Toolkit Instructions'!D5))","v":"Enter Project Name on Instructions Tab"}]
[]
[null,null,{"$f":"IF('Toolkit Instructions'!$D$7=\"\",\"Enter Project Sponsor on Instructions Tab\",CONCATENATE(\"Project Sponsor: \",'Toolkit Instructions'!$D$7))","v":"Enter Project Sponsor on Instructions Tab"}]
[]
[]
[]
[]
[]
[]
[]
[]
[]
[]
[]
[]
[]
[]
[]
[]
[]
[]
[]
[]
[]
[]
[]
[]
[]
[]
[]
[]
[]
[]
[]
[]
[]
[null,null,"A. Assumptions"]
[]
[]
[null,null,"1. Income Rate",null,null,0.03,null,"Note: Income and expense rates are assumed equal because PRAC rents are budget-based."]
[]
[null,null,"2. Expense Rate",null,null,0.03]
[]
[null,null,"3. Vacancy/Collection Loss"]
[]
[null,null,"4. Annual Debt Service, if Applicable"]
[]
[null,null,"B. 20-Year Operating Pro Forma"]
[]
[null,null,"Revenue",null,null,"Stabilized Year Data\t",null,2,3,4,5,6,7,8,9,10,11,12,13,14,15,16,17,18,19,20]
[null,null,"PRAC Gross Potential Contract Rent and Utilities ",null,null,{"$f":"'5a.Operating Cost Standard'!L51","v":0},null,{"$f":"F55*(1+$F$44)","v":0},{"$f":"H55*(1+$F$44)","v":0},0,0,0,0,0,0,0,0,0,0,0,0,0,0,0,0,0]
[null,null,"Non-PRAC Gross Potential Rent",null,null,{"$f":"'5a.Operating Cost Standard'!I64","v":0},null,{"$f":"F56*(1+$F$44)","v":0},{"$f":"H56*(1+$F$44)","v":0},0,0,0,0,0,0,0,0,0,0,0,0,0,0,0,0,0]
[null,null,"    Less: Vacancy and Collection Loss (X%)",null,null,{"$f":"-(F55+F56)*F48","v":0},null,{"$f":"-(H55+H56)*($F$48)","v":0},{"$f":"-(I55+I56)*($F$48)","v":0},{"$f":"-(J55+J56)*($F$48)","v":0},0,0,0,0,0,0,0,0,0,0,0,0,0,0,0,0]
[null,null,"    Plus: Other Non-Rental Income",null,null,null,null,{"$f":"F58*(1+$F$44)","v":0},{"$f":"H58*(1+$F$44)","v":0},0,0,0,0,0,0,0,0,0,0,0,0,0,0,0,0,0]
[null,null,"Effective Gross Revenue (Total)",null,null,{"$f":"F55+F56+F57+F58","v":0},null,{"$f":"H55+H56+H57+H58","v":0},{"$f":"I55+I56+I57+I58","v":0},0,0,0,0,0,0,0,0,0,0,0,0,0,0,0,0,0]
[]
[null,null,"Total Operating Expenses",null,null,null,null,{"$f":"F61*(1+$F$46)","v":0},{"$f":"H61*(1+$F$46)","v":0},0,0,0,0,0,0,0,0,0,0,0,0,0,0,0,0,0]
[null,null,"Annual Deposit to the Replacement Reserve",null,null,0,null,{"$f":"$F$62","v":0},{"$f":"$F$62","v":0},0,0,0,0,0,0,0,0,0,0,0,0,0,0,0,0,0]
[]
[null,null,"Net Operating Income (Total)",null,null,{"$f":"F59-F61-F62","v":0},null,{"$f":"H59-H61-H62","v":0},{"$f":"I59-I61-I62","v":0},{"$f":"J59-J61-J62","v":0},0,0,0,0,0,0,0,0,0,0,0,0,0,0,0,0]
[null,null,"    Less: Debt Service",null,null,{"$f":"-(F50)","v":0},null,{"$f":"F65","v":0},{"$f":"H65","v":0},0,0,0,0,0,0,0,0,0,0,0,0,0,0,0,0,0]
[null,null,"Project Cash Flow (Total)",null,null,{"$f":"F64+F65","v":0},null,{"$f":"H64+H65","v":0},{"$f":"I64+I65","v":0},0,0,0,0,0,0,0,0,0,0,0,0,0,0,0,0,0]
[]
[null,null,"Debt Service Coverage Ratio (Total)",null,null,{"$f":"IF(F64<0,F64/-F65,IF(F65<>0,ABS((F64/F65)),0))","v":0},null,{"$f":"IF(AND(H64<0,H65<>0),H64/-H65,IF(H65<>0,ABS((H64/H65)),0))","v":0},{"$f":"IF(AND(I64<0,I65<>0),I64/-I65,IF(I65<>0,ABS((I64/I65)),0))","v":0},0,0,0,0,0,0,0,0,0,0,0,0,0,0,0,0,0]
[]
[null,null,"C. Debt Service Test (only if debt service is indicated above)"]
[]
[null,null,{"$f":"IF(F65=0,\"Skip this section. No debt service is proposed in the pro forma\",\"\")","v":"Skip this section. No debt service is proposed in the pro forma"},null,null,null,null,null,null,{"$f":"ROUND('5a.Operating Cost Standard'!F39,0)","v":571},{"$f":"ROUND('5a.Operating Cost Standard'!I43,0)","v":125},{"$f":"ROUND('5a.Operating Cost Standard'!J43,0)","v":0}]
[null,null,"1. Do you plan to convert the PRAC to a Section 8 contract through RAD in order to support debt service?",null,null,"No",null,{"$f":"IF(F73=\"Yes\",\"Skip the remainder of this section\",\"\")","v":""}]
[]
[]
[null,null,{"$f":"IF(F73=\"Yes\", \"Note: If converting through RAD, the estimated per unit, per month rents will be:\", \"\")","v":""},null,null,"Contract Rent:",{"$f":"_xlfn.CONCAT(\"$\",J72+K72,\" ($\",J72,\" OCS + $\",K72, \" owner-paid utilities)\")","v":"$696 ($571 OCS + $125 owner-paid utilities)"}]
[null,null,null,null,null,"Total Rent:",{"$f":"_xlfn.CONCAT(\"$\",J72+K72+L72,\" ($\",J72+K72,\" contract rent + $\",L72,\" tenant-paid utilities)\")","v":"$696 ($696 contract rent + $0 tenant-paid utilities)"}]
[]
[null,null,"Please explain how you expect the rents above to cover the proposed debt service."]
[]
[]
[]
[null,null,"Total Operating Expenses",null,null,{"$f":"F61","v":0}]
[]
[null,null,"% Attributable to PRAC units based on square footage",null,null,{"$f":"IF((SUM('5a.Operating Cost Standard'!G56:G62)+SUM('5a.Operating Cost Standard'!G43:G49))<>0,((SUM('5a.Operating Cost Standard'!G43:G49)/(SUM('5a.Operating Cost Standard'!G56:G62)+SUM('5a.Operating Cost Standard'!G43:G49)))),0)","v":0}]
[]
[null,null,"% Attributable to non-PRAC units based on square footage",null,null,{"$f":"IF((SUM('5a.Operating Cost Standard'!G43:G49)+(SUM('5a.Operating Cost Standard'!G56:G62)))<>0,(SUM('5a.Operating Cost Standard'!G56:G62)/(SUM('5a.Operating Cost Standard'!G43:G49)+(SUM('5a.Operating Cost Standard'!G56:G62)))),0)","v":0}]
[]
[null,null,"2. Use Alternate Ratio of PRAC to Non-PRAC Expenses?",null,null,"Yes"]
[]
[null,null,"Alternate PRAC %"]
[]
[null,null,"Alternate Non-PRAC %"]
[]
[null,null,"PRAC + Non-PRAC Operating Pro Forma",null,"PRAC","Non-PRAC"]
[null,null,"Rental Revenue",null,{"$f":"F55","v":0},{"$f":"F56","v":0}]
[null,null,"Vacancy & Collection Loss",null,{"$f":"-E96*$F48","v":0},{"$f":"-F96*$F48","v":0}]
[null,null,"Other Non-Rental Income",null,null,{"$f":"F58","v":0}]
[null,null,"Effective Gross Income",null,{"$f":"SUM(E96:E98)","v":0},{"$f":"SUM(F96:F98)","v":0}]
[]
[null,null,"Operating Expenses",null,{"$f":"IF(F89=\"Yes\",F91*F83,F85*F83)","v":0},{"$f":"IF(F89=\"Yes\",F93*F83,F87*F83)","v":0}]
[null,null,"Annual Deposits to Replacement Reserve",null,{"$f":"IF(F89=\"Yes\",F91*F62,F85*F62)","v":0},{"$f":"IF(F89=\"Yes\",F93*F62,F87*F62)","v":0}]
[]
[null,null,"Net Operating Income",null,{"$f":"E99-(E101+E102)","v":0},{"$f":"F99-(F101+F102)","v":0}]
[]
[null,null,"Debt Service",null,null,{"$f":"F65","v":0}]
[]
[null,null,"Cash Flow",null,{"$f":"E104","v":0},{"$f":"F104+F106","v":0},null,{"$f":"IF(AND(F73<>\"Yes\",F104<ABS(F106)),\"Cash flow from Non-PRAC portion of building is insufficient to cover debt service. PRAC revenue cannot support debt service.\",\"\")","v":""}]
[null,null,"Debt Service Coverage Ratio",null,"N/A",{"$f":"IF(ABS(F106)>0,F104/ABS(F106),\"N/A\")","v":"N/A"},null,{"$f":"IF(AND(F73<>\"Yes\",F109<1.1),\"The debt service coverage ratio on non-PRAC revenue is below 1.11\",\"\")","v":""}]
[]
[null,null,"D. Additional Comments"]

{"sheet":"6. Intergenerational ","index":11,"n_rows":36,"n_cols":3,"rows_kept":36,"cut":false,"hidden":false,"merged":[]}
[]
[]
[null,null,"Intergenerational Dwelling Units"]
[]
[null,null,{"$f":"IF('Toolkit Instructions'!D5=\"\",\"Enter Project Name on Instructions Tab\",CONCATENATE(\"Project Name: \",'Toolkit Instructions'!D5))","v":"Enter Project Name on Instructions Tab"}]
[]
[null,null,{"$f":"IF('Toolkit Instructions'!$D$7=\"\",\"Enter Project Sponsor on Instructions Tab\",CONCATENATE(\"Project Sponsor: \",'Toolkit Instructions'!$D$7))","v":"Enter Project Sponsor on Instructions Tab"}]
[]
[]
[]
[]
[]
[]
[]
[]
[]
[]
[]
[]
[]
[]
[null,null,"A. Intergenerational Dwelling Units"]
[null,null,"1. Describe the need for intergenerational housing in your area as well as your plan for leasing up the building and finding qualified households to live in the project’s proposed intergenerational units. For example, an acceptable submission must include a written assessment of the intergenerational families’ housing needs in the relevant community, completed in consultation with local child welfare agencies, caregiver support groups, Area Agencies on Aging, or other supportive service providers working with the families; information in the community’s or State’s Consolidated Plan, Analysis of Impediments to Fair Housing Choice, or other planning document that analyzes fair housing issues and need for intergenerational housing;  a survey of the target population; waiting lists of other intergenerational housing in the community, or other documentation of the need and demand for intergenerational housing."]
[]
[]
[]
[null,null,"2. Describe how your proposed project’s design will meet the special physical needs of young children as well as older adults. An acceptable submission will describe the features of the project that make the property appropriate for children (e.g., electrical outlet protections, handrails in the bathrooms and hallways, shower thermostats that keep the water from getting too hot, secure outside play areas visible from the dwelling units, and adequate, flexible community space that can accommodate varying uses, multiple ages being served, and the changing needs of the residents)."]
[]
[]
[null,null,"3. Describe services, programming, or other supports in place at the property that support children raised by older adults. For example, an acceptable submission will describe items such as individualized case management, support groups, mental health services, before- and after-school activities, tutoring, safe and accessible transportation, recreational activities, or other programs designed for children."]
[]
[]
[null,null,"4. Describe prior experience of the project sponsor or its partners in owning, operating, developing, or managing intergenerational housing. An acceptable submission must identify rental housing projects and/or supportive services facilities that the sponsor or its partners own and/or operate that serve intergenerational families. The description should provide available information on successful performance of the project (e.g., occupancy rates, managing waitlists, testimonials from residents or community leaders on the quality of the activities, etc.)."]
[]
[]
[null,null,"Additional Comments"]

{"sheet":"Documentation Checklist","index":12,"n_rows":132,"n_cols":10,"rows_kept":132,"cut":false,"hidden":false,"merged":[[2,2,2,4]]}
[]
[]
[null,null,"Required Documentation"]
[]
[null,null,{"$f":"IF('Toolkit Instructions'!D5=\"\",\"Enter Project Name on Instructions Tab\",CONCATENATE(\"Project Name: \",'Toolkit Instructions'!D5))","v":"Enter Project Name on Instructions Tab"}]
[]
[null,null,{"$f":"IF('Toolkit Instructions'!$D$7=\"\",\"Enter Project Sponsor on Instructions Tab\",CONCATENATE(\"Project Sponsor: \",'Toolkit Instructions'!$D$7))","v":"Enter Project Sponsor on Instructions Tab"}]
[]
[]
[]
[]
[]
[]
[]
[]
[]
[]
[]
[]
[]
[]
[]
[]
[null,null,"Required Forms","Submitted?","Explanation, if \"No\" or \"N/A\" is selected"]
[null,null,"SF-424 (Submitted via Grants.gov webform)","No",null,null,null,null,null,"Here is one place, where \"Choose one\" is not necessary. Since \"No\" is the zero state. "]
[null,null,"SF-LLL (Submitted via Grants.gov webform)","No"]
[null,null,"HUD-2880 - Applicant/Recipient Disclosure/Update Report","No"]
[null,null,"HUD-2530 - Previous Participation Certification","No"]
[null,null,"HUD-92041 - Sponsor's Conflict of Interest Resolution, including attached listing of officers, titles, and start/end dates of their terms","No"]
[null,null,"HUD-92042 - Sponsor’s Resolution for Commitment to the Project","No"]
[null,null,"HUD-92015 - Section 202 Application for Capital Advance Summary Information","No"]
[null,null,"HUD-2991 - Certification of Consistency with the Consolidated Plan","No"]
[null,null,"Required Forms Complete?",{"$f":"IF((COUNTIF(D25:D32, \"No\")) > 0, \"No\", \"Yes\")","v":"No"}]
[]
[null,null,"Tab A: Eligibility and Articles of Incorporation","Submitted?","Explanation, if \"No\" or \"N/A\" is selected"]
[null,null,"Organizational Documents (articles of incorporation, constitution, resolutions, etc.)","No"]
[null,null,"Bylaws","No"]
[null,null,"IRS Tax Exemption Letter proving 501(c)(3) status","No"]
[null,null,"Evidence of structure, including graphic organizational chart indicating the relationship among parties and a list of the officers and terms","No"]
[null,null,"Tab A Complete?",{"$f":"IF((COUNTIF(D36:D39, \"No\")) > 0, \"No\", \"Yes\")","v":"No"}]
[]
[null,null,"Tab B: Demonstration of Need","Submitted?","Explanation, if \"No\" or \"N/A\" is selected"]
[null,null,"PDF of the 2020 American Communities Survey (ACS) 5-Year Census data used to calculate the Absorption Ratio","No"]
[null,null,"PDF of the 2023 Income Limit data used to calculate the Absorption Ratio","No"]
[null,null,"Tab B Complete?",{"$f":"IF((COUNTIF(D43:D44, \"No\")) > 0, \"No\", \"Yes\")","v":"No"}]
[]
[null,null,"Tab C: Development Plan","Submitted?","Explanation, if \"No\" or \"N/A\" is selected"]
[null,null,"Project development plan (3 pages maximum) with address, building type (row/walkup/elevator/detached), project type (NC/rehab/acq.), total and PRAC units, and common/office/commercial space description","No"]
[null,null,"Project development timeline identifying the projected dates for the major development stages for the project","No"]
[null,null,"If proposing intergenerational units, narrative (7 pages maximum) describing how the design meets physical needs of young children, intergenerational services, prior experience with intergenerational housing, and need/lease-up plan. (Can be satisfied with completion of Intergenerational tab in toolkit).","No"]
[null,null,"Written description (4 pages maximum) of how the project is well suited to meet the needs of an aging population and description of location of project, with description of nearby amenities and walking/transit distance, for amenities including health care and social service facilities, grocery stores, recreational facilities, civic facilities, adult educational facilities, and other neighborhood-serving amenities.","No"]
[null,null,"Site map","No"]
[null,null,"Market study, if needed","No"]
[null,null,"PDF of the 2020 American Communities Survey (ACS) 5-Year Census data for census tract poverty rate","No"]
[null,null,"Tab C Complete?",{"$f":"IF((COUNTIF(D48:D54, \"No\")) > 0, \"No\", \"Yes\")","v":"No"}]
[]
[null,null,"Tab D: Development Budget, Operating Pro Forma and Committed Funds","Submitted?","Explanation, if \"No\" or \"N/A\" is selected"]
[null,null,"Development budget supporting documentation","No"]
[null,null,"Documentation of all funding sources marked as committed or anticipated in 3b.Leverage and Committed Funds","No"]
[null,null,"20-year Operating Pro Forma","No"]
[null,null,"Documentation of PRAC year 1 rents within HUD Operating Cost Standards","No"]
[null,null,"If claiming leverage from donated or seller-financed land, a third-party appraisal of the land ","No"]
[null,null,"Tab D Complete?",{"$f":"IF(COUNTBLANK(D58:D62)>0,\"No\",IF(COUNTIF(D58:D62,\"No\")>0,\"No\",\"Yes\"))","v":"No"}]
[]
[null,null,"Tab E: Capital Needs Assessment","Submitted?","Explanation, if \"No\" or \"N/A\" is selected"]
[null,null,"If the project is not new construction or substantial (gut) rehabilitation, Capital Needs Assessment (CNA) or professional cost estimate identifying the rehabilitation needs of the property ","No"]
[null,null,"Tab E Complete?",{"$f":"IF(D66=\"No\", \"No\", \"Yes\")","v":"No"}]
[]
[null,null,"Tab F: Site Control and Zoning","Submitted?","Explanation, if \"No\" or \"N/A\" is selected"]
[null,null,"Evidence of site control (i.e., deed or long-term leasehold, contract of sale, option to purchase or option for long-term leasehold)","No"]
[null,null,"If the Seller/Lessor is a Public Body, evidence that the Public Body has clear title to the site and has entered into a legally binding agreement to lease or convey the site to the applicant after receipt and acceptance of Capital Advance funds","No"]
[null,null,"Evidence of compliance with local land-use and zoning regulations","No"]
[null,null,"Tab F Complete?",{"$f":"IF(COUNTBLANK(D70:D72)>0,\"No\",IF(COUNTIF(D70:D72,\"No\")>0,\"No\",\"Yes\"))","v":"No"}]
[]
[null,null,"Tab G: Site and Neighborhood Standards","Submitted?","Explanation, if \"No\" or \"N/A\" is selected"]
[null,null,"Output document from the Section 202 Elderly Minority Concentration Analysis Tool, or, if applicable, a certification that the site is or is not in an area of minority elderly concentration","No"]
[null,null,"If the site is in an area of minority elderly concentration, claim of an exception to be able to build in this area and evidence supporting the exception.","No",null,null,null,null,null," NOTE: On the Site and Neighborhood Standards section of this toolkit, you have indicated that you are claiming an exception. Make sure to submit evidence of your exception to ensure a complete application."]
[null,null,"Tab G Complete?",{"$f":"IF(COUNTBLANK(D76:D77)>0,\"No\",IF(COUNTIF(D76:D77,\"No\")>0,\"No\",\"Yes\"))","v":"No"}]
[]
[null,null,"Tab H: Real Property Acquisition and Relocation","Submitted?","Explanation, if \"No\" or \"N/A\" is selected"]
[null,null,"Narrative (5 pages maximum) stating whether the property was vacant or occupied at any time since the earlier of publication of this NOFO and securing of site control by the applicant. If the property was occupied, state whether relocation did or would occur and certify that the appropriate required General Information Notice (\"GIN\") was issued. If the development proposal will require the relocation of businesses or residents from an existing site, include a relocation plan and budget in compliance with the URA. If there will be relocation costs, reflect these costs in the project uses of funds or, if paid or anticipated to be paid outside the project budget, provide documentation evidencing how relocation costs will be paid","No"]
[null,null,"Tab H Complete?",{"$f":"IF(COUNTBLANK(D81)>0,\"No\",IF(COUNTIF(D81,\"No\")>0,\"No\",\"Yes\"))","v":"No"}]
[]
[null,null,"Tab I: Capacity of the Applicant and Relevant Organizational Experience, Capital Advance Delivery, and Experience Promoting Racial Equity","Submitted?","Explanation, if \"No\" or \"N/A\" is selected"]
[null,null,"Capacity and experience documentation (12 pages maximum, excluding resumes, which shall not exceed 4 pages per organization and property appraisal) ","No"]
[null,null,"Resumes for all parts of the development team (Sponsor, Management Agent, Consultants, and Developer)","No"]
[null,null,"Written description of experience in developing and operating similar housing","No"]
[null,null,"Written description of planned activities to train and employ or train individuals under Section 3","No"]
[null,null,"Tab I Complete?",{"$f":"IF(COUNTBLANK(D85:D88)>0,\"No\",IF(COUNTIF(D85:D88,\"No\")>0,\"No\",\"Yes\"))","v":"No"}]
[]
[null,null,"Tab J: Supportive Services","Submitted?","Explanation, if \"No\" or \"N/A\" is selected"]
[null,null,"Written supportive services plan","No"]
[null,null,"Partner letters of support","No"]
[null,null,"Tab J Complete?",{"$f":"IF(COUNTBLANK(D92:D93)>0,\"No\",IF(COUNTIF(D92:D93,\"No\")>0,\"No\",\"Yes\"))","v":"No"}]
[]
[null,null,"Tab K: Physical Design and Climate Resilience","Submitted?","Explanation, if \"No\" or \"N/A\" is selected"]
[null,null,"Physical design documentation (10 pages max; schematics, NRI output, and architect’s sign-off on green standard excluded from page limit)","No"]
[null,null,"Schematic drawings","No"]
[null,null,"Documentation of green standard or certification the applicant is building to","No"]
[null,null,"National Risk Index (NRI) output","No"]
[null,null,"Narrative describing documenting climate hazard risks and mitigation","No"]
[null,null,"Narrative assessing renewable energy","No"]
[null,null,"Narrative on innovative design elements","No"]
[null,null,"Tab K Complete?",{"$f":"IF(COUNTBLANK(D97:D103)>0,\"No\",IF(COUNTIF(D97:D103,\"No\")>0,\"No\",\"Yes\"))","v":"No"}]
[]
[null,null,"Tab L: Advancing Racial Equity and Affirmative Marketing","Submitted?","Explanation, if \"No\" or \"N/A\" is selected"]
[null,null,"Required narrative for advancing racial equity","No"]
[null,null,"Required narrative for Affirmative Marketing","No"]
[null,null,"Tab L Complete?",{"$f":"IF(COUNTBLANK(D107:D108)>0,\"No\",IF(COUNTIF(D107:D108,\"No\")>0,\"No\",\"Yes\"))","v":"No"}]
[]
[null,null,"Tab M: Environmental","Submitted?","Explanation, if \"No\" or \"N/A\" is selected"]
[null,null,"Partner Worksheets","No"]
[null,null,"HEROS Confirmation of submission","No"]
[null,null,"Phase 1 ESA Report","No"]
[null,null,"Phase 2 ESA (if required by the Phase 1)","No"]
[null,null,"Phase 3 Clean-up Plan (if required by the Phase 2)","No"]
[null,null,"Tab M Complete?",{"$f":"IF(COUNTBLANK(D112:D116)>0,\"No\",IF(COUNTIF(D112:D116,\"No\")>0,\"No\",\"Yes\"))","v":"No"}]
[]
[null,null,"Tab Q: Intergenerational Housing","Submitted?","Explanation, if \"No\" or \"N/A\" is selected"]
[null,null,"Narrative (no more than 7 pages) responding to questions to assess the applicant's capacity, experience, and project plan with respect to intergenerational dwelling units. Completion of Tab \"6. Intergenerational\" in this  toolkit satisfies this requirement.","No"]
[null,null,"Tab Q Complete?",{"$f":"IF(COUNTBLANK(D120)>0,\"No\",IF(COUNTIF(D120,\"No\")>0,\"No\",\"Yes\"))","v":"No"}]
[]
[null,null,"Tab R: Climate Change (Preference Points)","Submitted?","Explanation, if \"No\" or \"N/A\" is selected"]
[null,null,"Advancement of carbon reduction of project vulnerability to climate impacts and threats.","No"]
[null,null,"Tab R Complete?",{"$f":"IF(COUNTBLANK(D124)>0,\"No\",IF(COUNTIF(D124,\"No\")>0,\"No\",\"Yes\"))","v":"No"}]
[]
[null,null,"Tab S: Environmental Justice (Preference Points)","Submitted?","Explanation, if \"No\" or \"N/A\" is selected"]
[null,null,"Propose activities that reduce or mitigate exposure; improve protection from and resilience to environmental harms; and expand benefits and overcoming prior disinvestment.","No"]
[null,null,"Tab S Complete?",{"$f":"IF(COUNTBLANK(D128)>0,\"No\",IF(COUNTIF(D128,\"No\")>0,\"No\",\"Yes\"))","v":"No"}]
[]
[]
[null,null,"Additional Comments for Required Documentation"]

{"sheet":"HUD ONLY - Intake Review","index":13,"n_rows":145,"n_cols":5,"rows_kept":145,"cut":false,"hidden":true,"merged":[[2,2,2,4]]}
[]
[]
[null,null,"Intake Review"]
[]
[null,null,"Application Number:"]
[]
[null,null,"Application Name:"]
[]
[null,null,"Reviewer Name:"]
[]
[null,null,"QC Name:"]
[]
[]
[]
[]
[]
[]
[]
[]
[]
[]
[]
[null,null,"Required Forms",null,"Explanation, if \"No\" or \"N/A\" is selected"]
[null,null,"SF-424 (Submitted via Grants.gov webform)",null,"Enter note to explain N/A selection here."]
[null,null,"SF-LLL (Submitted via Grants.gov webform)"]
[null,null,"HUD-2880 - Applicant/Recipient Disclosure/Update Report"]
[null,null,"HUD-2530 - Previous Participation Certification"]
[null,null,"HUD-92041 - Sponsor's Conflict of Interest Resolution, including attached listing of officers, titles, and start/end dates of their terms"]
[null,null,"HUD-92042 - Sponsor’s Resolution for Commitment to the Project"]
[null,null,"HUD-92015 - Section 202 Application for Capital Advance Summary Information"]
[null,null,"HUD-2991 - Certification of Consistency with the Consolidated Plan"]
[null,null,"Required Forms Complete?",{"$f":"COUNTIF(D24:D30,\"<>Yes\")=0","v":false}]
[]
[null,null,"Tab A: Eligibility and Articles of Incorporation",null,"Explanation, if \"No\" or \"N/A\" is selected"]
[null,null,"Organizational Documents (articles of incorporation, constitution, resolutions, etc.)",null,"Enter note to explain N/A selection here."]
[null,null,"Bylaws"]
[null,null,"IRS Tax Exemption Letter proving 501(c)(3) status"]
[null,null,"Evidence of structure, including graphic organizational chart indicating the relationship among parties and a list of the officers and terms"]
[null,null,"Tab A Complete?",{"$f":"COUNTIF(D35:D38,\"<>Yes\")=0","v":false}]
[]
[null,null,"Tab B: Need",null,"Explanation, if \"No\" or \"N/A\" is selected"]
[null,null,"Tab B: PDF of the 2020 American Communities Survey (ACS) 5-Year Census data used to calculate the Absorption Ratio",null,"Enter note to explain N/A selection here."]
[null,null,"Tab B: PDF of the 2022 Income Limit data used to calculate the Absorption Ratio"]
[null,null,"Absorption ratio calculated correctly?"]
[null,null,"Absorption ratio equal to or less than 30%?",{"$f":"IF(#REF!<0.3,\"Yes\",#REF!)","v":{"$error":"#REF!"}}]
[null,null,"Tab B Complete?",{"$f":"COUNTIF(D42:D45,\"<>Yes\")=0","v":false}]
[]
[null,null,"Tab C: Development Plan",null,"Explanation, if \"No\" or \"N/A\" is selected"]
[null,null,"Project development plan (3 pages maximum) with address, building type (row/walkup/elevator/detached), project type (NC/rehab/acq.), total and PRAC units, and common/office/commercial space description",null,"Enter note to explain N/A selection here."]
[null,null,"Project development timeline identifying the projected dates for the major development stages for the project"]
[null,null,"If proposing intergenerational units, narrative (7 pages maximum) describing how the design meets physical needs of young children, intergenerational services, prior experience with intergenerational housing, and need/lease-up plan. (Can be satisfied with completion of Intergenerational tab in toolkit)."]
[null,null,"Are Capital Advance funds used for acquisition of facilities currently owned and operated by the Sponsor as housing for the elderly, except with rehabilitation as defined in 24 CFR 891.105?"]
[null,null,"Are Capital Advance funds used for units in Section 202 direct loan projects previously refinanced under the provisions of Section 811 of the American Homeownership and Economic Opportunity Act of 2000, 12 U.S.C. 1701q note?"]
[null,null,"Are Capital Advance funds used to construct/operate assisted living facilities, nursing homes, infirmaries, medical facilities, mobile homes, community centers, headquarters, or units w/o individual kitchens/bathrooms?"]
[null,null,"Tab C Complete?",{"$f":"COUNTIF(D49:D54,\"<>Yes\")=0","v":false}]
[]
[null,null,"Tab D: Development Budget",null,"Explanation, if \"No\" or \"N/A\" is selected"]
[null,null,"Development budget",null,"Enter note to explain N/A selection here."]
[null,null,"Total sources equals total uses? ",{"$f":"IF('3 Leverage and Committed Funds'!E125<>0,\"No\",\"Yes\")","v":"Yes"}]
[null,null,{"$f":"_xlfn.CONCAT(\"Capital Advance in the development budget equals the amount on SF-424? - \",'3 Leverage and Committed Funds'!E90)","v":"Capital Advance in the development budget equals the amount on SF-424? - 0"}]
[null,null,"Capital Advance request is less than the TDC?",{"$f":"IF('3 Leverage and Committed Funds'!E90<'3 Leverage and Committed Funds'!D74,\"Yes\",\"No\")","v":"No"}]
[null,null,"Are Capital Advance funds used for the financing or refinancing of Federally assisted units or properties servicing or encumbered by Federally insured debt?"]
[null,null,"Tab D Complete?",{"$f":"COUNTIF(D58:D62,\"<>Yes\")=0","v":false}]
[]
[null,null,"Tab E: Committed Funds",null,"Explanation, if \"No\" or \"N/A\" is selected"]
[null,null,"Did the owner deposit in a special escrow account the Minimum Capital Investment of 0.5% of the HUD approved Capital Advance Award, not to exceed $10,000 (or $25,000 if the owner has a National Sponsor/Co-Sponsor)?",null,"Enter note to explain N/A selection here."]
[null,null,"Tab E Complete?",{"$f":"COUNTIF(D66,\"<>Yes\")=0","v":false}]
[]
[null,null,"Tab F: Capital Needs Assessment",null,"Explanation, if \"No\" or \"N/A\" is selected"]
[null,null,"If the project is not new construction or substantial (gut) rehabilitation, Capital Needs Assessment (CNA) or professional cost estimate identifying the rehabilitation needs of the property ",null,"Enter note to explain N/A selection here."]
[null,null,"Tab F Complete?",{"$f":"COUNTIF(D70,\"<>Yes\")=0","v":false}]
[]
[null,null,"Tab G: Operating Pro Forma",null,"Explanation, if \"No\" or \"N/A\" is selected"]
[null,null,"20-year Operating Pro Forma (if not completed in Toolkit)",null,"Enter note to explain N/A selection here."]
[null,null,"PRAC year 1 rents are within HUD Operating Cost Standards"]
[null,null,"Unit counts match across all Toolkit tabs and align with other Tabs such as Development Plan and Physical Design"]
[null,null,"Tab G Complete?",{"$f":"COUNTIF(D74:D76,\"<>Yes\")=0","v":false}]
[]
[null,null,"Tab H: Site Control",null,"Explanation, if \"No\" or \"N/A\" is selected"]
[null,null,"Evidence of site control (i.e., deed or long-term leasehold, contract of sale, option to purchase or option for long-term leasehold)",null,"Enter note to explain N/A selection here."]
[null,null,"Tab H Complete?",{"$f":"COUNTIF(D80:D80,\"<>Yes\")=0","v":false}]
[]
[null,null,"Tab I: Site and Neighborhood Standards",null,"Explanation, if \"No\" or \"N/A\" is selected"]
[null,null,"Output document from the Section 202 Elderly Minority Concentration Analysis Tool, or, if applicable, a certification that the site is or is not in an area of minority elderly concentration",null,"Enter note to explain N/A selection here."]
[null,null,"Does the address on the report match the address of the actual project (N/A for projects located in Guam, the Northern Mariana Islands, American Samoa, or the U.S. Virgin Islands)?"]
[null,null,"Did the applicant indicate that the site is in an area of minority elderly concentration?"]
[null,null,"If the site is in an area of minority elderly concentration, did the applicant claim an exception to be able to build in this area and submit evidence supporting this exception?"]
[null,null,"Tab I Complete?",{"$f":"COUNTIF(D84:D87,\"<>Yes\")=0","v":false}]
[]
[null,null,"Tab J: Real Property Acquisition and Relocation",null,"Explanation, if \"No\" or \"N/A\" is selected"]
[null,null,"Narrative (5 pages maximum) stating whether the property was vacant or occupied at any time since the earlier of publication of this NOFO and securing of site control by the applicant. If the property was occupied, state whether relocation did or would occur and certify that the appropriate required General Information Notice (\"GIN\") was issued. If the development proposal will require the relocation of businesses or residents from an existing site, include a relocation plan and budget in compliance with the URA. If there will be relocation costs, reflect these costs in the project uses of funds or, if paid or anticipated to be paid outside the project budget, provide documentation evidencing how relocation costs will be paid",null,"Enter note to explain N/A selection here."]
[null,null,"Tab J Complete?",{"$f":"COUNTIF(D91,\"<>Yes\")=0","v":false}]
[]
[null,null,"Tab K: Physical Design",null,"Explanation, if \"No\" or \"N/A\" is selected"]
[null,null,"Physical design documentation (10 pages max; schematics, NRI output, and architect’s sign-off on green standard excluded from page limit)",null,"Enter note to explain N/A selection here."]
[null,null,"Schematic drawings"]
[null,null,"Documentation of green standard or certification the applicant is building to"]
[null,null,"National Risk Index (NRI) output"]
[null,null,"Narrative describing documenting climate hazard risks and mitigation"]
[null,null,"Narrative assessing renewable energy"]
[null,null,"Narrative on innovative design elements",null,"Enter note to explain N/A selection here."]
[null,null,"Tab K Complete?",{"$f":"COUNTIF(D95:D101,\"<>Yes\")=0","v":false}]
[]
[null,null,"Tab L: Supportive Services",null,"Explanation, if \"No\" or \"N/A\" is selected"]
[null,null,"Written supportive services plan",null,"Enter note to explain N/A selection here."]
[null,null,"Partner letters of support"]
[null,null,"Tab L Complete?",{"$f":"COUNTIF(D105:D106,\"<>Yes\")=0","v":false}]
[]
[null,null,"Tab M: Section 3 Employment Opportunities for Low and Very-Low Income Persons",null,"Explanation, if \"No\" or \"N/A\" is selected"]
[null,null,"Written description of planned activities to train and employ or train individuals under Section 3",null,"Enter note to explain N/A selection here."]
[null,null,"Tab M Complete?",{"$f":"COUNTIF(D110,\"<>Yes\")=0","v":false}]
[]
[null,null,"Tab N: Market",null,"Explanation, if \"No\" or \"N/A\" is selected"]
[null,null,"Written description (4 pages maximum) of how the project is well suited to meet the needs of an aging population and description of location of project, with description of nearby amenities and walking/transit distance, for amenities including health care and social service facilities, grocery stores, recreational facilities, civic facilities, adult educational facilities, and other neighborhood-serving amenities.",null,"Enter note to explain N/A selection here."]
[null,null,"Site map"]
[null,null,"Market study, if needed"]
[null,null,"PDF of the 2019 American Communities Survey (ACS) 5-Year Census data for census tract poverty rate"]
[null,null,"Tab N Complete?",{"$f":"COUNTIF(D114:D117,\"<>Yes\")=0","v":false}]
[]
[null,null,"Tab O: Capacity and Leverage",null,"Explanation, if \"No\" or \"N/A\" is selected"]
[null,null,"Capacity and leverage documentation (12 pages maximum, excluding resumes, which shall not exceed 4 pages per organization and property appraisal) ",null,"Enter note to explain N/A selection here."]
[null,null,"Resumes for all parts of the development team (Sponsor, Management Agent, Consultants, and Developer)"]
[null,null,"Written description of experience in developing and operating similar housing"]
[null,null,"If claiming leverage from donated or seller-financed land, a third-party appraisal of the land "]
[null,null,"Tab O Complete?",{"$f":"COUNTIF(D121:D124,\"<>Yes\")=0","v":false}]
[]
[null,null,"Tab P: Evidence of Compliance with Local Land-Use and Zoning Regulations",null,"Explanation, if \"No\" or \"N/A\" is selected"]
[null,null,"Evidence of compliance with local land-use and zoning regulations",null,"Enter note to explain N/A selection here."]
[null,null,"Tab P Complete?",{"$f":"COUNTIF(D128,\"<>Yes\")=0","v":false}]
[]
[null,null,"Tab Q: Intergenerational Housing",null,"Explanation, if \"No\" or \"N/A\" is selected"]
[null,null,"Narrative (no more than 7 pages) responding to questions to assess the applicant's capacity, experience, and project plan with respect to intergenerational dwelling units. Completion of Tab \"6. Intergenerational\" in this  toolkit satisfies this requirement."]
[null,null,"Tab Q Complete?",{"$f":"COUNTIF(D132,\"<>Yes\")=0","v":false}]
[]
[null,null,"Other",null,"Explanation, if \"No\" or \"N/A\" is selected"]
[null,null,"If Intergovernmental Review is required, did the applicant include a copy of the cover letter sent to the SPOC? ",null,"Enter note to explain N/A selection here."]
[null,null,"Does the application appear complete?"]
[null,null,"HEROS Complete?",{"$f":"COUNTIF(D136:D137,\"<>Yes\")=0","v":false}]
[]
[]
[null,null,null,"Intake Review Completed By:"]
[null,null,null,"Date:"]
[]
[]
[null,null,"Additional Comments for Required Documentation"]

{"sheet":"HUD ONLY - Environmental","index":14,"n_rows":78,"n_cols":21,"rows_kept":78,"cut":false,"hidden":true,"merged":[[59,1,59,6],[1,4,1,11],[3,4,3,11],[5,4,5,11],[7,10,7,14],[13,1,13,5],[45,1,45,5],[47,1,47,6],[49,1,49,6],[51,1,51,6],[53,1,53,5],[57,1,57,6],[77,1,77,6],[61,1,61,5],[65,1,65,5],[67,1,67,6],[69,1,69,6],[71,1,71,5],[73,1,73,6]]}
[]
[null,null,"Application Number:",null,999999]
[]
[null,null,"Application Name",null," Housing Development Corp "]
[]
[null,null,"Reviewer Name:",null,"Jane Doe"]
[null,null,null,null,null,null,null,null,null,null,null,null,null,null,null,null,null,null,null,null,"Yes"]
[null,null,null,null,null,null,null,null,null,null,null,null,null,null,null,null,null,null,null,null,"No"]
[]
[]
[]
[null,"Environmental Screen Questions",null,null,null,null,null,null,null,null,null,"Rating",null,"Comments"]
[]
[null,"1. Did the applicant submit required environmental review documents into HEROS? Do they identify any site issues that cannot be reasonably mitigated? Examples include Risk Based Corrective Action Plan or Complete Clean Up Plan, but lacks likely approval of such by the relevant regulatory authority; a project that would result in destruction of a valuable wetland; a project located in a Superfund area or flood channel/floodway; or a project for which a noise barrier to reduce noise to acceptable levels appears to be necessary but is not proposed in the application and/or does not appear to be achievable. "]
[]
[null,"(a) Airport Hazards"]
[]
[null,"(b) Coastal Barrier Resources Act"]
[]
[null,"(c) Endangered Species Act"]
[]
[null,"(d) Explosive and Flammable Facilities"]
[]
[null,"(e) Flood Insurance"]
[]
[null,"(f) Floodplain Management"]
[]
[null,"(g) Historic Preservation"]
[]
[null,"(h) Noise Abatement and Control (CEST for existing projects or EA for new construction)"]
[]
[null,"(i) Site Contamination"]
[]
[null,"(j) Sole Source Aquifers"]
[]
[null,"(k) Wetlands"]
[]
[null,"(l) Housing Requirements"]
[]
[null,"Phase 1 ESA Report"]
[]
[null,"Phase 2 ESA Report (if required by the Phase I)"]
[]
[null,"Phase 3 Clean-up Plan (if required by the Phase II)"]
[]
[null," 2.Was the Phase I ESA prepared in accordance with the requirements of ASTM E1527-13 “Standard Practice for Environmental Site Assessments, Phase I Environmental Site Assessment Process?” The Phase I ESA must utilize the table of contents and report format specified in Appendix X4 of the 2020 MAP Guide. "]
[]
[null,"3. Did the Environmental Professional preparing the Phase I ESA meet all of the qualification requirements of Appendix X2 of ASTM E1527-13?"]
[]
[null,"4. Did the applicant’s Phase I ESA report incorporate a vapor encroachment screen performed in accordance with ASTM E2600-15?"]
[]
[null,"5. Radon. NOTE: If a project did not complete the radon testing, this can be followed-up on in the full environmental review."]
[]
[null,"5a. Did the applicant submit a Radon test that follows the protocols set by the American Association of Radon Scientists and Technologists, Protocol for Conducting Radon and Radon Decay Product Measurements in Multifamily Buildings? Or, if the site is vacant or they plan to remove existing structures, did they report the Radon Zone?"]
[]
[null,"5b. Were there any readings above 4.0 picocuries per liter (4.0 pCi/L)?"]
[]
[null,"6. Does the Findings section of the Phase I list known or suspect Recognized Environmental Conditions (REC), Controlled Recognized Environmental Conditions (CREC), Historical Recognized Environmental Conditions (HREC), de minimis conditions (such as minor soil staining) and any Vapor Encroachment Conditions (VECs), likely VECs, and circumstances in which VECs cannot be ruled out? If so, could these be reasonably mitigated?"]
[]
[null,"7. Phase I Opinion Section."]
[]
[null,"7a. Does the Opinion Section discuss each finding from the Findings Section and whether it is a REC pursuant to Section 12.6 of ASTM E1527-13?"]
[]
[null,"7b. Does the Opinion Section provide justifications for any Finding deemed not to be a REC?"]
[]
[null,"8. If the Phase II is required, has the Phase II been prepared in accordance with the requirements of ASTM E1903-19 using the table of contents and report format specified in Appendix X3.2 as amended by X3.3? NOTE: If a Remediation Plan is required and was not submitted, the application will be rejected."]
[]
[null,"9. If there is a Remediation Plan, does the Remediation Plan include an approval letter from the local, State or Tribal, and/or Federal environmental (LSTF) Authorities or No Further Action Letter (“NFA”) from the LSTF?"]
[]
[null,"10. If there is no approval letter, is there evidence of a discussion of the feasibility of securing necessary approvals prior to HUD’s completion of the environmental review?"]
[]
[null,"11. Has the Site been determined to be located on an EPA designated Superfund National Priority List (NPL) Site? If not, is it near one?"]
[]
[null,"12. Are there any major adverse environmental conditions, contamination, or other identified issues within the Related Laws & Authorities that cannot reasonably be mitigated? NOTE: If major adverse environmental conditions which cannot be reasonably mitigated, the application will be rejected. Examples include regulatory floodway/floodplains, unregistered Superfund sites, noise, explosives, controversial or difficult to resolve historical sites, etc."]
[]
[]
[]
[null,"Considering the results above, should this application proceed?"]

{"sheet":"HUD ONLY - Scoresheet","index":15,"n_rows":154,"n_cols":16,"rows_kept":154,"cut":false,"hidden":true,"merged":[[154,11,159,15],[40,1,40,6],[1,4,1,11],[3,4,3,11],[7,4,7,11],[11,10,11,16],[37,1,37,5],[9,4,9,11],[5,4,5,11]]}
[]
[null,null,"Application Number:"]
[]
[null,null,"Applicant Name:"]
[]
[null,null,"Project Name:"]
[]
[null,null,"Reviewer Name:"]
[]
[null,null,"QC Name:"]
[]
[]
[null,null,null,null,null,null,null,"Max Score",null,null,null,"Applicant Self Score",null,"Reviewer Score",null,"Comments"]
[]
[]
[]
[null,"Rating Factor 1: Physical Design and Supportive Services",null,null,null,null,null,39,null,null,null,{"$f":"SUM(L19,L36)","v":{"$error":"#REF!"}},null,{"$f":"SUM(N19,N36)","v":0}]
[]
[null,"Physical Design ",null,null,null,null,null,26,null,null,null,{"$f":"SUM(L25,L29)","v":{"$error":"#REF!"}},null,{"$f":"SUM(N25,N29)","v":0}]
[]
[null,"Physical Design"]
[]
[null,"Contains intergenerational units?",null,null,null,null,null,null,null,null,null,{"$f":"#REF!","v":{"$error":"#REF!"}}]
[]
[null,"Physical Design & Livability Template",null,null,null,null,null,22,null,null,null,{"$f":"#REF!","v":{"$error":"#REF!"}}]
[null,"Required Building Design Components Met?",null,null,null,null,null,null,null,null,null,{"$f":"#REF!","v":{"$error":"#REF!"}}]
[null,"Category Minimums Met?",null,null,null,null,null,null,null,null,null,{"$f":"#REF!","v":{"$error":"#REF!"}}]
[]
[null,"Narrative on innovative design features",null,null,null,null,null,4,null,null,null,"N/A"]
[null,"(0) Applicant does not propose additional innovative design features"]
[null,"(1) Applicant proposes 1 additional innovative design feature"]
[null,"(2) Applicant proposes 2-3 additional innovative design features"]
[null,"(3) Applicant proposes 4-5 additional innovative design features"]
[null,"(4) Applicant proposes 6+ additional innovative design features"]
[]
[null,"Supportive Services",null,null,null,null,null,{"$f":"SUM(H38,H41,H44,H47,H50,H53,H58,H61)","v":13},null,null,null,{"$f":"SUM(L38,L41,L44,L47,L50,L53,L58,L61)","v":1},null,{"$f":"SUM(N38,N41,N44,N47,N50,N53,N58,N61)","v":0}]
[null,"Supportive Services Plan"]
[null,"           Activities of Daily Living (ADL)\nAre activities in which people engage on a day-to-day basis. These are everyday personal care activities that are fundamental to caring for oneself and maintaining independence (Bathing, dressing, grooming, mouth care, toileting, transferring bed/chair, walking, climbing stairs, eating).",null,null,null,null,null,1,null,null,null,{"$f":"'4 Supportive Services'!G40","v":0}]
[null,"(0) Services plan does not address resident support for ADLs"]
[null,"(1) Services plan addresses resident support for ADLs"]
[null,"           Instrumental Activities of Daily Living\nAre activities related to independent living and are valuable for evaluating persons with early-stage disease, both to assess the level of disease and to determine the person’s ability to care for himself or herself (shopping, cooking, managing medications, using the phone and looking up phone numbers, doing housework, doing laundry, driving or using public transportation, managing finances)",null,null,null,null,null,1,null,null,null,{"$f":"'4 Supportive Services'!G41","v":0}]
[null,"(0) Services plan does not address resident support for IADLs"]
[null,"(1) Services plan addresses resident support for IADLs"]
[null,"Social Isolation",null,null,null,null,null,1,null,null,null,{"$f":"'4 Supportive Services'!G42","v":0}]
[null,"(0) Services plan does not address social isolation"]
[null,"(1) Services plan addresses social isolation"]
[null,"Physical Health",null,null,null,null,null,1,null,null,null,{"$f":"'4 Supportive Services'!G43","v":0}]
[null,"(0) Services plan does not address physical health"]
[null,"(1) Services plan addresses physical health"]
[null,"Reliable Funding",null,null,null,null,null,1,null,null,null,{"$f":"'4 Supportive Services'!G44","v":0}]
[null,"(0) Applicant does not identify a reliable, sustainable source of funding"]
[null,"(1) Applicant identifies a reliable, sustainable source of funding"]
[null,"Years of Experience implementing a comparable plan",null,null,null,null,null,6,null,null,null,{"$f":"'4 Supportive Services'!G45","v":0}]
[null,"(0) None"]
[null,"(2) 1-3 years"]
[null,"(4) 4-9 years "]
[null,"(6) 10+ years"]
[null,"Evidence of Efficacy (tracking/measuring resident outcomes)",null,null,null,null,null,1,null,null,null,{"$f":"'4 Supportive Services'!G46","v":1}]
[null,"(0) Applicant can not demonstrate improved resident outcomes"]
[null,"(1) Applicant can demonstrate evidence of improved resident outcomes"]
[null,"Other partnerships",null,null,null,null,null,1,null,null,null,{"$f":"'4 Supportive Services'!G47","v":0}]
[null,"(0) The applicant does not identify supportive services partnerships."]
[null,"(.5) The applicant identifies at least one supportive services partnership, but not a state or local government entity."]
[null,"(1) The applicant identifies at least one supportive services partnership, including a state or local government entity."]
[]
[null,"Rating Factor 2: Market",null,null,null,null,null,16,null,null,null,{"$f":"SUM(L94,L69,L77,L81,L85,L89,L73)","v":2},null,{"$f":"SUM(N94,N69,N77,N81,N85,N89,N73)","v":0}]
[]
[null,"Neighborhood and Context",null,null,null,null,null,12]
[null,"Healthcare and social services",null,null,null,null,null,2,null,null,null,{"$f":"'2 Soundness of Approach'!E74","v":0}]
[null,"(0) Amenity is not readily available"]
[null,"(1) Amenity is available within 1/2 mile walk or 30 minutes by transit/shuttle"]
[null,"(2) Amenity is available within 1/4 mile walk or 15 minutes by transit/shuttle"]
[null,"Grocery store",null,null,null,null,null,2,null,null,null,{"$f":"'2 Soundness of Approach'!E74","v":0}]
[null,"(0) Amenity is not readily available"]
[null,"(1) Amenity is available within 1/2 mile walk or 30 minutes by transit/shuttle"]
[null,"(2) Amenity is available within 1/4 mile walk or 15 minutes by transit/shuttle"]
[null,"Parks and green space",null,null,null,null,null,2,null,null,null,{"$f":"'2 Soundness of Approach'!E75","v":0}]
[null,"(0) Amenity is not readily available"]
[null,"(1) Amenity is available within 1/2 mile walk or 30 minutes by transit/shuttle"]
[null,"(2) Amenity is available within 1/4 mile walk or 15 minutes by transit/shuttle"]
[null,"Recreational facilities",null,null,null,null,null,2,null,null,null,{"$f":"'2 Soundness of Approach'!E76","v":1}]
[null,"(0) Amenity is not readily available"]
[null,"(1) Amenity is available within 1/2 mile walk or 30 minutes by transit/shuttle"]
[null,"(2) Amenity is available within 1/4 mile walk or 15 minutes by transit/shuttle"]
[null,"Other neighborhood amenities",null,null,null,null,null,2,null,null,null,{"$f":"'2 Soundness of Approach'!E78","v":1}]
[null,"(0) Amenity is not readily available"]
[null,"(1) Amenity is available within 1/2 mile walk or 30 minutes by transit/shuttle"]
[null,"(2) Amenity is available within 1/4 mile walk or 15 minutes by transit/shuttle"]
[null,"Overall evaluation of amenity accessibility",null,null,null,null,null,2,null,null,null,"N/A"]
[null,"(0) Access to amenities at the site is minimal"]
[null,"(1) Access to amenities at the site is moderate"]
[null,"(2) Access to amenities at the side is considerable"]
[null,"Market",null,null,null,null,null,4]
[null,"Poverty Rate",null,null,null,null,null,4,null,null,null,{"$f":"'2 Soundness of Approach'!E79","v":0}]
[null,"(0) Poverty rate of 30% or greater."]
[null,"(2) Poverty rate between 10% and 30%"]
[null,"(4) Poverty rate of 10% or less"]
[]
[null,"Rating Factor 3: Capacity, Project Leverage, and Committed Funding",null,null,null,null,null,35,null,null,null,{"$f":"SUM(L101,L110,L115,L121,L134)","v":9},null,{"$f":"SUM(N101,N110,N115,N121,N134)","v":0}]
[null,"Development and Management Experience",null,null,null,null,null,15]
[null,"Elderly Affordable Housing Properties Placed in Service in Past 5 Years",null,null,null,null,null,8,null,null,null,{"$f":"'1 Capacity'!$E$61","v":5}]
[null,"(0) 0 projects"]
[null,"(2) 1 project"]
[null,"(4) 2 projects"]
[null,"(6) 3 or more projects"]
[null,"Capital Advance Delivery",null,null,null,null,null,null,null,null,null,{"$f":"'1 Capacity'!$E$60","v":2}]
[null,"(0) Sponsor (or a co-developer) has not placed in service a Capital Advance Project within 3 Years of Award"]
[null,"(1) Sponsor (or a co-developer) has placed in service a Capital Advance Project within 3 Years of Award "]
[null,"(2) Sponsor (or a co-developer) has placed in service a Capital Advance Project within 2 Years of Award "]
[null,"Operating and Management Experience",null,null,null,null,null,6,null,null,null,{"$f":"'1 Capacity'!$E$62","v":3}]
[null,"(0) 0 years owning/operating affordable senior housing"]
[null,"(2) 1-5 years owning/operating affordable senior housing"]
[null,"(4) 6-9 years owning/operating affordable senior housing"]
[null,"(6) 10+ years owning/operating affordable senior housing"]
[null,"PRAC Property Management",null,null,null,null,null,1,null,null,null,{"$f":"'1 Capacity'!$E$63","v":1}]
[null,"(0) Property has no PRAC experience"]
[null,"(0) Property has PRAC experience, but no property with iREMS score >80"]
[null,"(1)Property has PRAC experience AND property with iREMS score >80"]
[]
[null,"Project Leverage",null,null,null,null,null,10]
[null,"Leverage Ratio",null,null,null,null,null,10,null,null,null,{"$f":"'3 Leverage and Committed Funds'!F151","v":0}]
[null,"(0) ratio <0.33"]
[null,"(1) ratio >=.33 but less than 0.5"]
[null,"(2) ratio >=0.5 but less than .75"]
[null,"(3) ratio >= 0.75 but less than 1.0"]
[null,"(5) ratio >= 1.0 but less than 2.0"]
[null,"(7) ratio >=2.0 but less than 4.0"]
[null,"(9) ratio >=4.0 but less than 6.0"]
[null,"(11) ratio >=6.0 but less than 8.0"]
[null,"(13) ratio >=8.0 but less than 10.0"]
[null,"(15) ratio >=10.0"]
[]
[null,"Commitment of Sources",null,null,null,null,null,10]
[null,"Committed Funds %",null,"(CHECK LETTERS)",null,"(CHECK APPRAISAL)",null,10,null,null,null,{"$f":"'3 Leverage and Committed Funds'!F152","v":0}]
[null,"(0) <50%"]
[null,"(2) >=50% but less than 60%"]
[null,"(4) >=60% but less than 70%"]
[null,"(6) >=70% but less than 80%"]
[null,"(8) >=80% but less than 90%"]
[null,"(10) >=90%"]
[]
[]
[null,"Rating Factor 4: Land-use/Zoning",null,null,null,null,null,{"$f":"H144","v":10},null,null,null,{"$f":"L145","v":9},null,{"$f":"N145","v":0}]
[null,"Land Use & Zoning ",null,null,null,null,null,10]
[null,"Land Use & Zoning ",null,null,null,null,null,10,null,null,null,{"$f":"'2.3 Land Use & Zoning'!$E$69","v":9}]
[null,"(0) Not land use compliant"]
[null,"(4) Partially permitted"]
[null,"(10) Fully permitted"]
[]
[]
[]
[null,"Total Points",null,null,null,null,null,{"$f":"SUM(H17,H66,H99,H143)","v":100},null,null,null,{"$f":"SUM(L143,L99,L66,L17)","v":{"$error":"#REF!"}},null,{"$f":"SUM(N143,N99,N66,N17)","v":0}]
[]
[null,null,null,null,null,null,null,null,null,null,null,"Notes, unique deal structure, or flags for Production:"]

{"sheet":"HUD 2022 Operating Cost Std","index":16,"n_rows":254,"n_cols":8,"rows_kept":254,"cut":false,"hidden":true,"merged":[]}
["Metropolitan Statistical Area ","FY 22 Operating Cost Standards, net of utility expenses (per unit per year), + $15 PUPM svcs","FY 21 Values","FY 20 Values",null,null,null,"First Choice"]
["Akron, OH PMSA",7931.9898488446033,7540.8461564636218,7400.1428308302402,null,"Akron, OH PMSA 7037",null,"State Cost Standard"]
["Albany-Schenectady-Troy, NY MSA",7606.4191031049486,7217.1225491787654,7041.2156884762326,null,"Albany-Schenectady-Troy, NY MSA 6695",null,"MSA Cost Standard"]
["Albuquerque, NM MSA",7376.7067453673617,6960.0645506454175,6797.0928549056398,null,"Albuquerque, NM MSA 6463"]
["Alexandria, LA MSA",8166.3535484436188,7768.8264089918466,7638.7669369458872,null,"Alexandria, LA MSA 7264"]
["Allentown-Bethlehem-Easton, PA MSA",8189.7639236959249,7791.5991475641295,7616.436023975557,null,"Allentown-Bethlehem-Easton, PA MSA 7242"]
["Altoona, PA MSA",8277.9353146047324,7877.3689830785333,7700.2776658016237,null,"Altoona, PA MSA 7322"]
["Anchorage, AK MSA",9651.5653200854358,9240.5515317906702,8928.0181750574557,null,"Anchorage, AK MSA 8490"]
["Appleton-Oshkosh-Neenah, WI MSA",7279.0625691354981,6872.2774144583727,6672.0759278557716,null,"Appleton-Oshkosh-Neenah, WI MSA 6344"]
["Asheville, NC MSA",7395.3662689397352,6991.633981530751,6821.0349826123902,null,"Asheville, NC MSA 6486"]
["Atlanta, GA MSA",7329.1616769263055,6934.2014325182408,6778.3394204052056,null,"Atlanta, GA MSA 6446"]
["Atlantic-Cape May, NJ PMSA",9280.438253733515,8835.3769453723453,8578.0520562826168,null,"Atlantic-Cape May, NJ PMSA 8157"]
["Augusta-Aiken, GA-SC MSA",7519.7551988638952,7119.0642084033907,6959.0469832503732,null,"Augusta-Aiken, GA-SC MSA 6617"]
["Austin-San Marcos, TX MSA",8413.5448684224011,7970.5177816286559,7745.8428639582289,null,"Austin-San Marcos, TX MSA 7366"]
["Bakersfield, CA MSA",8730.1320374064617,8260.9971375907844,8020.2712846963996,null,"Bakersfield, CA MSA 7626"]
["Baltimore, MD PMSA",8846.23208444386,8405.6567259397289,8232.7217988102257,null,"Baltimore, MD PMSA 7828"]
["Bangor, ME MSA",7675.8765031983767,7348.8985325474277,7148.7474971793645,null,"Bangor, ME MSA 6798"]
["Barnstable-Yarmouth, MA MSA",9993.6706805411413,9537.0949276395932,9232.3722315089126,null,"Barnstable-Yarmouth, MA MSA 8779"]
["Baton Rouge, LA MSA",7649.1708466140271,7265.730395538937,7144.0933541734175,null,"Baton Rouge, LA MSA 6793"]
["Beaumont-Port Arthur, TX MSA",7370.7528432974286,6961.0385704718583,6764.8191013520163,null,"Beaumont-Port Arthur, TX MSA 6433"]
["Bergen-Passaic, NJ PMSA",10264.269148376176,9790.5525712390045,9505.4087827964777,null,"Bergen-Passaic, NJ PMSA 9039"]
["Biloxi-Gulfport-Pascagoula, MS MSA",8015.6938698599251,7600.0910473908107,7414.7581232603361,null,"Biloxi-Gulfport-Pascagoula, MS MSA 7051"]
["Birmingham, AL MSA",7239.1600038230672,6846.9059202939552,6679.9337218035516,null,"Birmingham, AL MSA 6352"]
["Boise City, ID MSA",7153.7664989768355,6757.5256773031351,6592.645288554043,null,"Boise City, ID MSA 6269"]
["Boston, MA-NH PMSA",10689.461514293285,10213.276495911843,9886.9489114874941,null,"Boston, MA-NH PMSA 9401"]
["Bridgeport, CT PMSA",10341.947402156862,9875.5562703176511,9578.5097806945523,null,"Bridgeport, CT PMSA 9108"]
["Buffalo-Niagara Falls, NY MSA",7738.9671763505321,7345.935059621509,7166.8885814084242,null,"Buffalo-Niagara Falls, NY MSA 6815"]
["Burlington, VT MSA",10036.821766461544,9569.7298703510132,9586.8539106695844,null,"Burlington, VT MSA 9116"]
["Canton-Massillon, OH MSA",7296.3051661597856,6922.4758425678847,6793.3105801482061,null,"Canton-Massillon, OH MSA 6460"]
["Cedar Rapids, IA MSA",6810.977753736478,6425.3660404423235,6226.0706805958389,null,"Cedar Rapids, IA MSA 5920"]
["Charleston-North Charleston, SC MSA",8200.3413983170649,7786.7392216670542,7611.6420116553136,null,"Charleston-North Charleston, SC MSA 7238"]
["Charleston, WV MSA",7028.5464207650548,6629.7642020958911,6518.7739975888389,null,"Charleston, WV MSA 6199"]
["Charlotte-Gastonia-Rock Hill, NC-SC MSA",6422.1263222115667,6048.5720176468667,5900.9841528041115,null,"Charlotte-Gastonia-Rock Hill, NC-SC MSA 5611"]
["Chattanooga, TN-GA MSA",6360.9166660916871,6000.889967079308,5871.6564631175142,null,"Chattanooga, TN-GA MSA 5583"]
["Chicago, IL PMSA",11024.919351527187,10529.047914104065,10262.405588708314,null,"Chicago, IL PMSA 9758"]
["Cincinnati, OH-KY-IN PMSA",7524.7089635917418,7144.6585248946903,7011.3475947803154,null,"Cincinnati, OH-KY-IN PMSA 6667"]
["Cleveland-Lorain-Elyria, OH PMSA",8649.5316936828676,8238.8440600027898,8085.1169139286594,null,"Cleveland-Lorain-Elyria, OH PMSA 7688"]
["Columbia, SC MSA",7074.1433906038537,6693.3430976736445,6542.8326376863788,null,"Columbia, SC MSA 6222"]
["Columbus, OH MSA",7909.5314855759207,7518.9994995874713,7378.7038068924448,null,"Columbus, OH MSA 7016"]
["Dallas, TX PMSA",7777.9480435181495,7355.2255987590997,7147.8946886320846,null,"Dallas, TX PMSA 6797"]
["Davenport-Moline-Rock Island, IA-IL MSA",6627.0860927508247,6247.1764464639773,6053.407987190828,null,"Davenport-Moline-Rock Island, IA-IL MSA 5756"]
["Dayton-Springfield, OH MSA",7414.2719682676843,7037.2295411164241,6905.9231095653913,null,"Dayton-Springfield, OH MSA 6567"]
["Daytona Beach, FL MSA",7729.6300747322739,7336.861102752453,7150.9162883084264,null,"Daytona Beach, FL MSA 6800"]
["Decatur, IL MSA",8412.3116690182487,7992.53560098859,7790.1290495281137,null,"Decatur, IL MSA 7408"]
["Denver, CO PMSA",8450.408135427404,8029.5224615800034,7856.6008901893256,null,"Denver, CO PMSA 7471"]
["Des Moines, IA MSA",7039.4657794252707,6646.7691661097579,6440.6065530479218,null,"Des Moines, IA MSA 6124"]
["Detroit, MI PMSA",7884.0836450857059,7457.970614797393,7283.1121193612325,null,"Detroit, MI PMSA 6925"]
["Dothan, AL MSA",6841.7724437821071,6461.4669677808997,6303.8942834702066,null,"Dothan, AL MSA 5994"]
["Duluth-Superior, MN-WI MSA",7440.2532437848686,7035.1291121946397,6843.4846277917668,null,"Duluth-Superior, MN-WI MSA 6507"]
["Dutchess County, NY PMSA",8507.0568321976152,8092.3778738557976,7895.1379381738689,null,"Dutchess County, NY PMSA 7507"]
["El Paso, TX MSA",6898.2649691180577,6503.6446942091561,6320.318356289541,null,"El Paso, TX MSA 6010"]
["Erie, PA MSA",7839.0965999179216,7450.4830738501178,7282.9885887331093,null,"Erie, PA MSA 6925"]
["Eugene-Springfield, OR MSA",6567.6661573762194,6189.5989897056388,6050.364085652961,null,"Eugene-Springfield, OR MSA 5753"]
["Evansville-Henderson, IN-KY MSA",7402.8949053188089,7005.7176579231909,6841.4951788962353,null,"Evansville-Henderson, IN-KY MSA 6506"]
["Fayetteville, NC MSA",6001.04425810463,5640.5467617292925,5502.9148957813341,null,"Fayetteville, NC MSA 5233"]
["Fayetteville-Springdale-Rogers, AR MSA",6082.0289612321067,5707.958376433372,5590.5408472724994,null,"Fayetteville-Springdale-Rogers, AR MSA 5316"]
["Flint, MI PMSA",6697.252623241181,6309.0538463128569,6161.1326864998719,null,"Flint, MI PMSA 5859"]
["Fort Lauderdale, FL PMSA",8463.7751209131948,8050.3159581274986,7846.2894015271249,null,"Fort Lauderdale, FL PMSA 7461"]
["Fort Myers-Cape Coral, FL MSA",7617.4686708175741,7227.8607102211608,7044.6783929104049,null,"Fort Myers-Cape Coral, FL MSA 6699"]
["Fort Wayne, IN MSA",6836.8386076155466,6456.681481683363,6305.3290734100601,null,"Fort Wayne, IN MSA 5996"]
["Fort Worth-Arlington, TX PMSA",7592.3904819422933,7175.5958198860544,6973.3283581930273,null,"Fort Worth-Arlington, TX PMSA 6631"]
["Fresno, CA MSA",8208.1211297362461,7756.6387726920248,7530.6099467463855,null,"Fresno, CA MSA 7161"]
["Gainesville, FL MSA",7521.9377835337636,7135.0221414322295,6954.1927173008517,null,"Gainesville, FL MSA 6613"]
["Gary, IN PMSA",7095.9243655848568,6707.9770762219759,6550.7339958549992,null,"Gary, IN PMSA 6229"]
["Grand Forks, ND-MN MSA",6583.1062163364923,6216.6079770257202,6070.8831815122585,null,"Grand Forks, ND-MN MSA 5773"]
["Grand Rapids-Muskegon-Holland, MI MSA",7500.9064544002631,7087.0343217814752,6920.8727447765486,null,"Grand Rapids-Muskegon-Holland, MI MSA 6581"]
["Greeley, CO PMSA",7174.3592305043721,6790.6400296158954,6644.3986870842291,null,"Greeley, CO PMSA 6318"]
["Greensboro--Winston-Salem--High Point, NC MSA",6244.8771833996607,5876.8189761624617,5733.4219624162924,null,"Greensboro--Winston-Salem--High Point, NC MSA 5452"]
["Greenville-Spartanburg-Anderson, SC MSA",6830.3307522472633,6456.6317982983137,6311.4441681784647,null,"Greenville-Spartanburg-Anderson, SC MSA 6002"]
["Hamilton-Middletown, OH PMSA",7324.3232291504282,6949.7307676560586,6820.0569603701633,null,"Hamilton-Middletown, OH PMSA 6485"]
["Harrisburg-Lebanon-Carlisle, PA MSA",7705.7543068267896,7320.7726720104956,7156.1942094862643,null,"Harrisburg-Lebanon-Carlisle, PA MSA 6805"]
["Hartford, CT MSA",10079.040373716736,9620.0586722222906,9330.6972853462103,null,"Hartford, CT MSA 8873"]
["Hickory-Morganton-Lenoir, NC MSA",6399.2244425907911,6026.3802738282857,5879.333897468724,null,"Hickory-Morganton-Lenoir, NC MSA 5591"]
["Honolulu, HI MSA",8080.7014748759229,7761.0034134341086,7498.6612895415665,null,"Honolulu, HI MSA 7130"]
["Houston, TX PMSA",7631.4034314968349,7213.3624699872562,7010.0304326625519,null,"Houston, TX PMSA 6666"]
["Huntington-Ashland, WV-KY-OH MSA",6518.9626780336857,6136.4595140693964,6033.7278217113935,null,"Huntington-Ashland, WV-KY-OH MSA 5737"]
["Huntsville, AL MSA",7247.7653802301775,6855.2525511446929,6688.0768073859062,null,"Huntsville, AL MSA 6360"]
["Indianapolis, IN MSA",7188.7466881035798,6798.0084268705923,6638.6549029608432,null,"Indianapolis, IN MSA 6313"]
["Jackson, MS MSA",7344.8989713746741,6949.4655396456592,6779.9985212145239,null,"Jackson, MS MSA 6447"]
["Jacksonville, FL MSA",8858.5270912653596,8433.942751472654,8220.1935884462764,null,"Jacksonville, FL MSA 7817"]
["Jamestown, NY MSA",6814.0656299066341,6447.0997375185952,6289.9610624115639,null,"Jamestown, NY MSA 5981"]
["Jersey City, NJ PMSA",10694.506830258404,10208.259058503305,9910.9498269594897,null,"Jersey City, NJ PMSA 9424"]
["Johnson City-Kingsport-Bristol, TN-VA MSA",5688.2645205320341,5347.8296315844991,5232.6602540968561,null,"Johnson City-Kingsport-Bristol, TN-VA MSA 4976"]
["Johnstown, PA MSA",7773.6214170234434,7386.7912616959566,7220.7286337051492,null,"Johnstown, PA MSA 6866"]
["Jonesboro, AR MSA",6649.8794636831926,6257.1368120727202,6128.4222182297644,null,"Jonesboro, AR MSA 5828"]
["Joplin, MO MSA",6511.9926128536135,6159.5258879898965,6080.2053179544537,null,"Joplin, MO MSA 5782"]
["Kalamazoo-Battle Creek, MI MSA",7402.8451967646897,6992.1057083878895,6828.1698138600295,null,"Kalamazoo-Battle Creek, MI MSA 6493"]
["Kansas City, MO-KS MSA",6852.6021534798256,6490.8581259531375,6407.2707564165175,null,"Kansas City, MO-KS MSA 6093"]
["Knoxville, TN MSA",6225.029666779079,5868.9608415330858,5742.5685266719902,null,"Knoxville, TN MSA 5461"]
["Lafayette, LA MSA",7329.6960063392225,6954.9572046101384,6838.522879203294,null,"Lafayette, LA MSA 6503"]
["Lake Charles, LA MSA",7895.222777662053,7505.0805230175611,7379.4364734406117,null,"Lake Charles, LA MSA 7017"]
["Lancaster, PA MSA",6777.247350592811,6417.5557885144071,6273.2825659793989,null,"Lancaster, PA MSA 5965"]
["Lansing-East Lansing, MI MSA",6264.0866984166769,5889.7257487092711,5751.6360945468432,null,"Lansing-East Lansing, MI MSA 5469"]
["Las Vegas, NV-AZ MSA",7521.3788397071003,7120.6390297838034,6926.6060580294061,null,"Las Vegas, NV-AZ MSA 6586"]
["Lawrence, MA-NH PMSA",9338.7575372681295,8900.6390060914782,8616.2519117194024,null,"Lawrence, MA-NH PMSA 8193"]
["Lewiston-Auburn, ME MSA",7496.3223358225923,7172.8650351201886,6977.5083626914793,null,"Lewiston-Auburn, ME MSA 6635"]
["Lexington, KY MSA",7141.0946542876482,6758.3443245511144,6625.7647649327937,null,"Lexington, KY MSA 6300"]
["Lima, OH MSA",7174.2859021941676,6803.780060500163,6676.82952185671,null,"Lima, OH MSA 6349"]
["Little Rock-North Little Rock, AR MSA",6907.9771187262131,6506.7476970272855,6372.8983962663488,null,"Little Rock-North Little Rock, AR MSA 6060"]
["Los Angeles-Long Beach, CA PMSA",8607.3428017731148,8142.3601949498707,7905.0914282554158,null,"Los Angeles-Long Beach, CA PMSA 7517"]
["Louisville, KY-IN MSA",7366.4805550681067,6977.1655874447633,6840.2933748812284,null,"Louisville, KY-IN MSA 6504"]
["Lowell, MA-NH PMSA",10317.279091730039,9851.5831795238482,9536.8121711195981,null,"Lowell, MA-NH PMSA 9069"]
["Lynchburg, VA MSA",6191.8967638977711,5825.4813603660568,5688.8925665733859,null,"Lynchburg, VA MSA 5410"]
["Macon, GA MSA",7207.2932424091268,6815.9973253240805,6662.792220450704,null,"Macon, GA MSA 6336"]
["Madison, WI MSA",7628.2172648312398,7210.2780879295651,7000.2300492714185,null,"Madison, WI MSA 6657"]
["Manchester, NH PMSA",9515.1411681763893,9116.3487970472543,8824.9607992683395,null,"Manchester, NH PMSA 8392"]
["Mansfield, OH MSA",7036.9869248781606,6670.2207440449029,6545.7622652584814,null,"Mansfield, OH MSA 6224"]
["Medford-Ashland, OR MSA",6938.7088890473242,6549.1365203946934,6401.8138268629091,null,"Medford-Ashland, OR MSA 6087"]
["Melbourne-Titusville-Palm Bay, FL MSA",8956.190557718166,8528.8537975881118,8312.6992166845976,null,"Melbourne-Titusville-Palm Bay, FL MSA 7905"]
["Memphis, TN-AR-MS MSA",7163.498178878207,6780.0953192992301,6634.0810647278449,null,"Memphis, TN-AR-MS MSA 6308"]
["Miami, FL PMSA",7927.5349734808651,7529.1885067841258,7338.3693621661569,null,"Miami, FL PMSA 6978"]
["Middlesex-Somerset-Hunterdon, NJ PMSA",9889.8944434918612,9427.081983972681,9152.524051587452,null,"Middlesex-Somerset-Hunterdon, NJ PMSA 8703"]
["Milwaukee-Waukesha, WI PMSA",7450.082860615702,7037.8343277983568,6832.8098781270255,null,"Milwaukee-Waukesha, WI PMSA 6497"]
["Minneapolis-St. Paul, MN-WI MSA",7885.7903639353526,7466.8511278443339,7263.4460713503058,null,"Minneapolis-St. Paul, MN-WI MSA 6907"]
["Mobile, AL MSA",7065.3492060723011,6678.3212474028142,6515.4602421713953,null,"Mobile, AL MSA 6196"]
["Monmouth-Ocean, NJ PMSA",9352.289072934238,8905.1350222662495,8645.7784723304885,null,"Monmouth-Ocean, NJ PMSA 8221"]
["Monroe, LA MSA",6517.1855841396209,6164.5774164782306,6061.3749967091871,null,"Monroe, LA MSA 5764"]
["Montgomery, AL MSA",7397.0958296231729,7000.0929482281026,6829.3850514336564,null,"Montgomery, AL MSA 6494"]
["Nashville, TN MSA",7130.3509757146658,6747.9135686550153,6602.592371350499,null,"Nashville, TN MSA 6278"]
["Nassau-Suffolk, NY PMSA",8683.3538557705942,8263.7063710112689,8062.2905525064934,null,"Nassau-Suffolk, NY PMSA 7666"]
["New Bedford, MA PMSA",8800.4837865104691,8377.5352638585719,8109.8620203916898,null,"New Bedford, MA PMSA 7712"]
["New Haven-Meriden, CT PMSA",11107.755389602289,10619.781719730117,10300.349700503928,null,"New Haven-Meriden, CT PMSA 9795"]
["New London-Norwich, CT-RI MSA",9149.1066480144236,8716.3329912676618,8454.1547355248294,null,"New London-Norwich, CT-RI MSA 8039"]
["New Orleans, LA MSA",7645.3065358497443,7261.9713383752378,7140.3972281352662,null,"New Orleans, LA MSA 6790"]
["New York, NY PMSA",11289.616097171462,10796.51710123563,10533.367706603874,null,"New York, NY PMSA 10016"]
["Newark, NJ PMSA",9631.8672941460281,9176.5701884912887,8909.3082572146122,null,"Newark, NJ PMSA 8472"]
["Newburgh, NY-PA PMSA",8901.8451667116005,8476.0400065224494,8269.4488646128375,null,"Newburgh, NY-PA PMSA 7863"]
["Norfolk-Virginia Beach-Newport News, VA-NC MSA",7186.2999415945287,6789.0503310024505,6629.8689452343406,null,"Norfolk-Virginia Beach-Newport News, VA-NC MSA 6304"]
["Oakland, CA PMSA",10279.196108002274,9757.6773990360143,9473.3382115228414,null,"Oakland, CA PMSA 9008"]
["Oklahoma City, OK MSA",6805.8254551523169,6445.355501120931,6343.72034695198,null,"Oklahoma City, OK MSA 6032"]
["Omaha, NE-IA MSA",7674.4016025440596,7262.0170567287396,7084.9485859735969,null,"Omaha, NE-IA MSA 6737"]
["Orange County, CA PMSA",8571.4790138939334,8107.7091921680531,7871.4501573569732,null,"Orange County, CA PMSA 7485"]
["Orlando, FL MSA",8192.6558285255414,7786.8375398693315,7589.4885589933565,null,"Orlando, FL MSA 7217"]
["Parkersburg-Marietta, WV-OH MSA",7106.1164731272147,6704.8562179353485,6592.6088830174995,null,"Parkersburg-Marietta, WV-OH MSA 6269"]
["Pensacola, FL MSA",6799.5779492183328,6433.0203588127633,6269.9824110880436,null,"Pensacola, FL MSA 5962"]
["Peoria-Pekin, IL MSA",8449.2487384823471,8028.3968334780075,7825.0821161035237,null,"Peoria-Pekin, IL MSA 7441"]
["Philadelphia, PA-NJ PMSA",8680.5974290598733,8269.0636469454021,8083.166632722784,null,"Philadelphia, PA-NJ PMSA 7686"]
["Phoenix-Mesa, AZ MSA",7554.5530622104743,7159.7602545732761,7012.4311197215047,null,"Phoenix-Mesa, AZ MSA 6668"]
["Pittsburgh, PA MSA",8122.2869075328308,7725.9600267829092,7552.2725378115574,null,"Pittsburgh, PA MSA 7181"]
["Pittsfield, MA MSA",9254.9079591990248,8819.1525356647471,8537.3690409375304,null,"Pittsfield, MA MSA 8118"]
["Ponce, PR MSA",8096.7586865286494,7693.6430384146261,7513.237547871463,null,"Ponce, PR MSA 7144"]
["Portland, ME MSA",8423.737010109513,8082.095107950503,7861.9750863397649,null,"Portland, ME MSA 7476"]
["Portland-Vancouver, OR-WA PMSA",7513.5085128542014,7106.1129000525207,6946.2610341284308,null,"Portland-Vancouver, OR-WA PMSA 6605"]
["Providence-Fall River-Warwick, RI-MA MSA",9809.9657599090224,9376.7923660263132,9094.8685473719179,null,"Providence-Fall River-Warwick, RI-MA MSA 8648"]
["Racine, WI PMSA",7762.0582834336237,7339.8434495969259,7126.0209448551741,null,"Racine, WI PMSA 6776"]
["Raleigh-Durham-Chapel Hill, NC MSA",6348.5543816249583,5977.2813775435643,5831.4330362322189,null,"Raleigh-Durham-Chapel Hill, NC MSA 5545"]
["Redding, CA MSA",8055.1576157173131,7608.8479378911243,7387.1257439615556,null,"Redding, CA MSA 7024"]
["Richmond-Petersburg, VA MSA",7148.8941844431147,6752.8044422898392,6594.4729059870242,null,"Richmond-Petersburg, VA MSA 6271"]
["Riverside-San Bernardino, CA PMSA",8527.8583532532284,8065.5636263316228,7830.5327153308663,null,"Riverside-San Bernardino, CA PMSA 7446"]
["Roanoke, VA MSA",7315.6120267709857,6914.3527391191719,6752.2334150545939,null,"Roanoke, VA MSA 6421"]
["Rochester, MN MSA",8111.0150476857389,7685.092100470677,7475.7419251298525,null,"Rochester, MN MSA 7109"]
["Rochester, NY MSA",7813.3280265631674,7418.200220178006,7237.392383827374,null,"Rochester, NY MSA 6882"]
["Rockford, IL MSA",9131.3327970720293,8690.6143660893486,8470.5293553081083,null,"Rockford, IL MSA 8055"]
["Rocky Mount, NC MSA",6199.7671210612261,5833.1076754469241,5690.7772370053535,null,"Rocky Mount, NC MSA 5411"]
["Sacramento, CA PMSA",8322.5912828004075,7867.2379543965299,7637.9862629902436,null,"Sacramento, CA PMSA 7263"]
["Saginaw-Bay City-Midland, MI MSA",7438.3968785591242,7026.5216636583973,6861.7788576436969,null,"Saginaw-Bay City-Midland, MI MSA 6525"]
["St. Cloud, MN MSA",7048.1341978429855,6655.1687963594823,6473.8748396669771,null,"St. Cloud, MN MSA 6156"]
["St. Joseph, MO MSA",5814.5752529500751,5481.1043316634969,5410.5202756959743,null,"St. Joseph, MO MSA 5145"]
["St. Louis, MO-IL MSA",7476.6180046334475,7097.877436413859,7006.4730500152509,null,"St. Louis, MO-IL MSA 6662"]
["Salem, OR PMSA",6911.6368520905526,6522.9039264443336,6376.1713345827557,null,"Salem, OR PMSA 6063"]
["Salt Lake City-Ogden, UT MSA",7713.1472910683069,7292.4949574717402,7149.382250383881,null,"Salt Lake City-Ogden, UT MSA 6798"]
["San Antonio, TX MSA",7313.9323218895797,6906.0332254497389,6711.3642605383902,null,"San Antonio, TX MSA 6382"]
["San Diego, CA MSA",9005.3185330101605,8526.8778096716542,8278.4041812377345,null,"San Diego, CA MSA 7872"]
["San Francisco, CA PMSA",11034.953863336088,10487.878128827138,10182.260857017918,null,"San Francisco, CA PMSA 9682"]
["San Jose, CA PMSA",10494.681338073764,9965.8756889601591,9675.4695932906961,null,"San Jose, CA PMSA 9200"]
["San Juan-Bayamon, PR PMSA",7527.7085313299103,7140.6302539649278,6973.1921628913205,null,"San Juan-Bayamon, PR PMSA 6631"]
["Santa Cruz-Watsonville, CA PMSA",10868.842623758643,10327.384177544584,10026.443707175118,null,"Santa Cruz-Watsonville, CA PMSA 9534"]
["Santa Rosa, CA PMSA",9762.0538378355195,9258.0230317251408,8988.2437964453366,null,"Santa Rosa, CA PMSA 8547"]
["Sarasota-Bradenton, FL MSA",8342.107510044003,7932.0772692361552,7731.0473444048848,null,"Sarasota-Bradenton, FL MSA 7351"]
["Savannah, GA MSA",10129.961197181612,9650.7868061897316,9433.8633342189441,null,"Savannah, GA MSA 8971"]
["Scranton--Wilkes-Barre--Hazleton, PA MSA",7365.0735661292601,6989.37117327749,6832.2429556363204,null,"Scranton--Wilkes-Barre--Hazleton, PA MSA 6497"]
["Seattle-Bellevue-Everett, WA PMSA",7575.873438611181,7166.5440296619972,7012.2006222759992,null,"Seattle-Bellevue-Everett, WA PMSA 6668"]
["Sharon, PA MSA",7312.6643311964044,6938.3894272338566,6782.4073314238894,null,"Sharon, PA MSA 6449"]
["Shreveport-Bossier City, LA MSA",7081.9231989079863,6713.9330728676905,6601.5337805114596,null,"Shreveport-Bossier City, LA MSA 6277"]
["Sioux City, IA-NE MSA",5895.8031750243708,5538.5689680468704,5366.7793628206618,null,"Sioux City, IA-NE MSA 5103"]
["Sioux Falls, SD MSA",6627.6215130834316,6253.7551048335908,6131.0974754457166,null,"Sioux Falls, SD MSA 5830"]
["South Bend, IN MSA",7572.7410650489164,7170.4569011143712,7002.3727353579652,null,"South Bend, IN MSA 6659"]
["Spokane, WA MSA",6847.1109663902862,6460.3788434014396,6321.2438740817825,null,"Spokane, WA MSA 6011"]
["Springfield, MA MSA",9887.0119541882468,9433.4421323500956,9132.0312790270782,null,"Springfield, MA MSA 8684"]
["Stamford-Norwalk, CT PMSA",11253.476016048524,10761.395545236661,10437.703929021973,null,"Stamford-Norwalk, CT PMSA 9925"]
["Steubenville-Weirton, OH-WV MSA",6325.7882267421046,5978.3932166751993,5866.8434263629761,null,"Steubenville-Weirton, OH-WV MSA 5579"]
["Stockton-Lodi, CA MSA",7440.2596352763248,7014.7436089626335,6810.3336436790214,null,"Stockton-Lodi, CA MSA 6476"]
["Sumter, SC MSA",7252.9624851423232,6866.9538690702166,6712.5394948983148,null,"Sumter, SC MSA 6383"]
["Syracuse, NY MSA",8334.0728530775359,7924.2690506098506,7731.126522884083,null,"Syracuse, NY MSA 7352"]
["Tacoma, WA PMSA",7091.2503454250027,6696.9480091327541,6552.7181306113516,null,"Tacoma, WA PMSA 6231"]
["Tampa-St. Petersburg-Clearwater, FL MSA",7569.4605629715434,7181.2056005554359,6999.2057065709714,null,"Tampa-St. Petersburg-Clearwater, FL MSA 6656"]
["Toledo, OH MSA",7704.9403090128271,7319.980845343217,7183.3986068062814,null,"Toledo, OH MSA 6831"]
["Topeka, KS MSA",6439.2699956345195,6076.9611608102132,5981.0778689302451,null,"Topeka, KS MSA 5687"]
["Trenton, NJ PMSA",10664.520042789978,10179.145672611628,9882.6843504260596,null,"Trenton, NJ PMSA 9397"]
["Tucson, AZ MSA",7231.2255678152151,6845.8500658400144,6704.9803814283187,null,"Tucson, AZ MSA 6376"]
["Tulsa, OK MSA",6241.9539076849387,5896.8423226507184,5803.8565318020419,null,"Tulsa, OK MSA 5519"]
["Utica-Rome, NY MSA",7524.2089357596242,7137.2292864525025,6963.2697077784624,null,"Utica-Rome, NY MSA 6621"]
["Washington, DC-MD-VA-WV PMSA",8984.8255044741127,8556.6817341828119,8323.6361014493268,null,"Washington, DC-MD-VA-WV PMSA 7915"]
["Waterbury, CT PMSA",9931.4187665040372,9476.5974407230697,9191.5512188916073,null,"Waterbury, CT PMSA 8740"]
["Waterloo-Cedar Falls, IA MSA",7024.9615113825612,6632.7146428125588,6426.9879584216142,null,"Waterloo-Cedar Falls, IA MSA 6111"]
["West Palm Beach-Boca Raton, FL MSA",8674.0774518181497,8254.6914011838198,8045.4851698828079,null,"West Palm Beach-Boca Raton, FL MSA 7650"]
["Wheeling, WV-OH MSA",7082.4015555756541,6681.8988921351929,6570.0358903863398,null,"Wheeling, WV-OH MSA 6247"]
["Wichita, KS MSA",6629.2832572963625,6261.4400556275359,6162.6460254279727,null,"Wichita, KS MSA 5860"]
["Wilmington-Newark, DE-MD PMSA",8175.9691604914633,7733.0456097596352,7611.0469619554615,null,"Wilmington-Newark, DE-MD PMSA 7237"]
["Worcester, MA-CT PMSA",9536.6106502894854,9092.9160838576154,8802.3854845728201,null,"Worcester, MA-CT PMSA 8370"]
["Yakima, WA MSA",6262.8453772345611,5894.2300167001558,5767.2880010048666,null,"Yakima, WA MSA 5484"]
["Youngstown-Warren, OH MSA",7290.7760838856175,6917.0973578653866,6788.0324516482897,null,"Youngstown-Warren, OH MSA 6455"]
["Alabama",6685.9596192462141,6310.3391069313429,6156.4519050083081,null,"Alabama"]
["Alaska",11536.054173665438,11079.077242600428,10704.361384112543,null,"Alaska"]
["Arizona",7556.2962794717178,7161.4526985162311,7014.0887375958437,null,"Arizona"]
["Arkansas",6308.0457724040989,5926.5433001973879,5804.629294368754,null,"Arkansas"]
["California",8259.2012791360212,7805.9915740444667,7578.524605099813,null,"California"]
["Colorado",7400.4698242263639,7010.1648778896733,6859.1959090384562,null,"Colorado"]
["Connecticut",10309.389760384647,9843.9161908499973,9547.8214019999996,null,"Connecticut"]
["Delaware",7904.9272650359044,7470.9161170560001,7353.0528959999992,null,"Delaware"]
["Florida",8043.6340963826788,7642.0156427431284,7448.3370163159325,null,"Florida"]
["Georgia",6847.8219758691675,6467.3346031708707,6321.9664891828124,null,"Georgia"]
["Hawaii",9316.919756756226,8975.3632188175106,8671.9725714875785,null,"Hawaii"]
["Idaho",6933.650436279042,6544.2349188750404,6384.5587224362098,null,"Idaho"]
["Illinois",8023.0435919606298,7614.6054290879902,7421.769750577746,null,"Illinois"]
["Indiana",6680.7575517064024,6305.2934546133883,6157.4897644464045,null,"Indiana"]
["Iowa",6282.3017444084817,5913.0830856671337,5729.6771887979376,null,"Iowa"]
["Kansas",6334.9538007898918,5975.6833017377585,5881.3979885621884,null,"Kansas"]
["Kentucky",6526.9517175640558,6162.0890461786948,6041.2063250803576,null,"Kentucky"]
["Louisiana",7538.1076268785673,7157.692244045299,7037.8638909171468,null,"Louisiana"]
["Maine",7940.0119484595225,7607.8548514309041,7400.651007385447,null,"Maine"]
["Maryland",7014.2482422078847,6628.7567819669111,6492.3791486154259,null,"Maryland"]
["Massachusetts",11053.534119607308,10567.088551610601,10229.456207785815,null,"Massachusetts"]
["Michigan",7064.5658588714732,6664.6329708339536,6508.3749545309611,null,"Michigan"]
["Minnesota",6636.0303014404972,6255.8433153493188,6085.4274142968261,null,"Minnesota"]
["Mississippi",7209.2292305005303,6817.8751023283521,6651.6169981567364,null,"Mississippi"]
["Missouri",6132.3410977512076,5790.2150756334704,5715.6503820549297,null,"Missouri"]
["Montana",6832.7075392584757,6440.1815481689027,6338.5673053257369,null,"Montana"]
["Nebraska",6417.8183716228514,6044.3976469213676,5897.018173750801,null,"Nebraska"]
["Nevada",7482.9328377641968,7083.3490181999978,6890.3321759999999,null,"Nevada"]
["New Hampshire",8810.1939293312698,8427.9237591125675,8158.5400525132136,null,"New Hampshire"]
["New Jersey",9665.5168767777614,9209.2396861920006,8941.0262759999987,null,"New Jersey"]
["New Mexico",6665.8217336877815,6272.5548681700011,6125.6813878957873,null,"New Mexico"]
["New York",7559.6206657943658,7171.64301826469,6996.8446549521905,null,"New York"]
["North Carolina",6191.8920188130905,5825.4767624157848,5683.3325216681133,null,"North Carolina"]
["North Dakota",6274.4862705293181,5916.976961678949,5778.2758788722012,null,"North Dakota"]
["Ohio",7358.2531792131358,6982.7365556548011,6852.4468991604463,null,"Ohio"]
["Oklahoma",6222.9305140146016,5878.3370758896899,5785.6430895205576,null,"Oklahoma"]
["Oregon",7051.689407695706,6658.6137671470015,6508.8283851643391,null,"Oregon"]
["Pennsylvania",7628.9167071443499,7246.027925237694,7083.129801122639,null,"Pennsylvania"]
["Puerto Rico",7779.4344340478283,7385.2618406684442,7212.0874708019119,null,"Puerto Rico"]
["Rhode Island",9827.4609813503957,9393.8276351999975,9111.3916319999989,null,"Rhode Island"]
["South Carolina",7414.5112685324566,7023.7973480897635,6865.8560989573598,null,"South Carolina"]
["South Dakota",5997.795590781172,5642.8667223871698,5532.1907135705196,null,"South Dakota"]
["Tennessee",6304.984144992779,5946.5865485366785,5818.5225079534621,null,"Tennessee"]
["Texas",7178.5760401017442,6775.0010068748743,6584.0256104024957,null,"Texas"]
["Utah",7318.8928446317359,6910.8352803792222,6775.2125132767214,null,"Utah"]
["Vermont",8341.0290716134405,7923.329195741203,7937.507172595655,null,"Vermont"]
["Virgin Islands",12650.203517456637,12154.19446145871,11962.377906112877,null,"Virgin Islands"]
["Virginia",6414.4794627871252,6041.1622701425631,5899.5164529919748,null,"Virginia"]
["Washington",7428.032938793961,7023.2877313894969,6872.0295858972877,null,"Washington"]
["West Virginia",7041.4434670786122,6642.2492420896542,6531.0500230385014,null,"West Virginia"]
["Wisconsin",6411.8654713235846,6032.7836121235096,5857.0380514222006,null,"Wisconsin"]
["Wyoming",7578.1648295626228,7175.7175844448338,7034.9234031384849,null,"Wyoming"]

{"sheet":"List Validations","index":17,"n_rows":12,"n_cols":25,"rows_kept":12,"cut":false,"hidden":true,"merged":[]}
["Complete - No Issues",null,"Committed",null,null,"9% LIHTC allocation with a pricing letter from an investor",null,null,"Detached/Semi-Detached",null,null,null,"Tool","Adjacent","Sufficient","Overriding - Rev Area","Overriding - Rev Strategy","Output",null,null,"Yes, but no state or local government",null,null,null,"Yes, within 1/4 mile walking distance or 15 minutes by public transportation or shuttle"]
["Complete - Issues",null,"Anticipated",null,null,"A preliminary 42(m) letter or other allocation documentation from the housing finance agency for 4% tax credits and an executed letter of intent with an investor for purchase of the 4% tax credits;",null,null,"Row House",null,null,null,"No","Yes","n/a","n/a","n/a","The report from the Elderly Minority Concentration Analysis Tool (or, where applicable, the certification by the applicant) identifying that the proposed site is located in a census tract that is not minority elderly concentrated \nAND where the tool identifies the site to be outside of an area of minority elderly concentration but the site is near the edge of an elderly minority-concentrated census tract or is separated from a significant portion of the occupied land in its census tract by a major geographic barrier (such as a river or interstate highway), the applicant must provide an explanation in the narrative that the immediate area of the site is distinct from the abutting immediate area within the area of minority elderly concentration. ",null,null,"Yes, including state or local government",null,null,null,"Yes, within 1/2 mile walking distance or 30 minutes by public transportation or shuttle"]
["Incomplete",null,"No",null,null,"A loan commitment letter",null,null,"Walkup",null,null,null,"No","No","n/a","n/a","n/a","The report from the Elderly Minority Concentration Analysis Tool showing that the proposed site is in a census tract that is not minority elderly concentrated.",null,null,"No",null,null,null,"No"]
["N/A",null,null,null,null,"Governmental resolutions, commitments, or other documentation of final award of grant or subordinate loan funds",null,null,"Elevator",null,null,null,"Insufficient data","n/a","n/a","n/a","n/a","A certification from the applicant, based on local knowledge and any available local data, stating it has determined that the site is not in an area of minority concentration. Applicant must provide a description of its analyses and provide references for the data relied upon to support this conclusion.  "]
[null,null,null,null,null,"Grant award letter",null,null,null,null,null,null,"Yes","n/a",true,true,true,"A report from the Elderly Minority Concentration Analysis Tool (or, where applicable, the certification by the applicant) identifying the location as an area of minority elderly concentration \nAND a justification for locating the project in an area of elderly minority concentration because sufficient, comparable opportunities exist for housing minority elderly households in the income range to be served by the proposed project, outside areas of minority concentration.  For each property claimed as comparable to Section 202, the applicant must provide the following information: Property name and address; Total number of comparable units, and number of comparable units in standard condition in the property; Household type (e.g., elderly, mixed elderly and disabled); Tenure (i.e., rental); Subsidy program; Income range served (as a percentage of area median income); and tenant payment the same as Section 202 or something else (specified). \nAND a justification for locating the project in an area of elderly minority concentration because the project is necessary to meet overriding housing needs that cannot be met in that housing market area, and the project is part of a \"revitalization strategy.\" To establish that a proposed project is an integral part of an overall local strategy for the preservation or restoration of the immediate neighborhood, the applicant must provide evidence demonstrating the following: (i) the proposed project is located in a defined geographic area that is the subject of an official, currently operational and realistically achievable plan for the improvement or revitalization of the immediate neighborhood (which plan may include areas beyond the immediate neighborhood); and (ii) the proposed project conforms to, and the site is integral to, the goals, strategies, and objectives of the improvement or revitalization plan. \n \nHUD will consider any of the following relevant factors for determining whether there is an official, operational, and achievable revitalization plan or strategy: \n• The plan or strategy  has been enacted, adopted, or ratified by a municipal, county, or state legislative body (required); \n• There have been actions to implement the plan or strategy– e.g., public funding approval or expenditures, private funding or financing commitment or expenditures, construction permits, land use changes, site improvements, public infrastructure development, new construction, rehabilitation, financial assistance for job creation, and employment training or employment readiness programs (required). \n• Approaches or activities under the plan are strategy are incorporated in current public, quasi-public agency or major institutional work plans (optional); \n• The plan or strategy  includes objectives and initiatives related to the preservation or restoration of a geography larger than the proposed project site (required); \n• A jurisdiction has published solicitations or incentives for development projects in the improvement or revitalization area (optional); \n• The specific plan or strategy is incorporated in the applicable jurisdiction’s Consolidated Plan or other comprehensive community development plan (optional); \n• A jurisdiction has explicitly designated the geographic area for improvement or revitalization (e.g., Business Improvement District; Enterprise Zone designation; Promise Zone designation; Choice Neighborhoods designation) (optional); \n• An implementing agency or private investor has retained a construction firm to break ground on the improvement or revitalization (optional); and \n• An implementing agency or private investor has secured financing, such as the issuance of bonds, final approval for tax increment financing,  allocation of Low-Income Housing Tax Credit (optional). \n\n\nAND a justification for locating the project in an area of elderly minority concentration because the project is necessary to meet overriding housing needs that cannot be met in that housing market area, and the project is part of a \"revitalizing area.\" The applicant must provide the Revitalization Report from the Analysis Tool, which includes data on indicators of revitalization, such as poverty rates, unemployment rates, and median household income, compared between the 2000 Census and 2012-2016 American Community Survey (ACS). Applicants may use this report to inform their analysis of whether their proposed project is in a revitalizing area. Applicants may also use other sources of data, including local data and local knowledge, when conducting this analysis. \n\nHUD will consider all relevant factors in making a determination that the site is located in a “revitalizing area” but in particular evidence that: \n(i) The neighborhood has demonstrated signs of revitalization, through indicators such as low or declining poverty rates, low or declining violent crime rates or evidence of high or increased educational opportunity, high or increasing median \nhousehold income, high or increasing homeownership rates and/or high or increased employment (required); \n(ii) There is private or public investment in retail, commercial, or housing development that has occurred or will imminently occur in the area which is relevant to improvements in the revitalization indicators above (required); \n(iii) Evidence of new or improved retail centers, grocery stores, pharmacies, healthcare facilities, community centers, educational and recreational facilities, municipal services, and transportation serving the neighborhood (optional); \n(iv) Evidence of private and public investment or housing development that has occurred or will imminently occur in the area (optional); \n(v) Evidence of improvement of economic conditions without the disproportionate displacement of low- and moderate-income or minority residents (optional); and \n(vi) Evidence of improvements in the area that bring about or preserve a mix of incomes among area residents; a mix of residential unit bedroom sizes; and the availability of accessible housing for persons with a disability. "]
[null,null,null,null,null,"Owner equity, including the minimum required commitment specified in Section III.C of NOFO",null,null,null,null,null,null,"Yes","n/a",true,true,false,"A report from the Elderly Minority Concentration Analysis Tool (or, where applicable, the certification by the applicant) identifying the location as an area of minority elderly concentration \nAND a justification for locating the project in an area of elderly minority concentration because sufficient, comparable opportunities exist for housing minority elderly households in the income range to be served by the proposed project, outside areas of minority concentration.  For each property claimed as comparable to Section 202, the applicant must provide the following information: Property name and address; Total number of comparable units, and number of comparable units in standard condition in the property; Household type (e.g., elderly, mixed elderly and disabled); Tenure (i.e., rental); Subsidy program; Income range served (as a percentage of area median income); and tenant payment the same as Section 202 or something else (specified). \nAND a justification for locating the project in an area of elderly minority concentration because the project is necessary to meet overriding housing needs that cannot be met in that housing market area, and the project is part of a \"revitalization strategy.\" To establish that a proposed project is an integral part of an overall local strategy for the preservation or restoration of the immediate neighborhood, the applicant must provide evidence demonstrating the following: (i) the proposed project is located in a defined geographic area that is the subject of an official, currently operational and realistically achievable plan for the improvement or revitalization of the immediate neighborhood (which plan may include areas beyond the immediate neighborhood); and (ii) the proposed project conforms to, and the site is integral to, the goals, strategies, and objectives of the improvement or revitalization plan. \n \nHUD will consider any of the following relevant factors for determining whether there is an official, operational, and achievable revitalization plan or strategy: \n• The plan or strategy  has been enacted, adopted, or ratified by a municipal, county, or state legislative body (required); \n• There have been actions to implement the plan or strategy– e.g., public funding approval or expenditures, private funding or financing commitment or expenditures, construction permits, land use changes, site improvements, public infrastructure development, new construction, rehabilitation, financial assistance for job creation, and employment training or employment readiness programs (required). \n• Approaches or activities under the plan are strategy are incorporated in current public, quasi-public agency or major institutional work plans (optional); \n• The plan or strategy  includes objectives and initiatives related to the preservation or restoration of a geography larger than the proposed project site (required); \n• A jurisdiction has published solicitations or incentives for development projects in the improvement or revitalization area (optional); \n• The specific plan or strategy is incorporated in the applicable jurisdiction’s Consolidated Plan or other comprehensive community development plan (optional); \n• A jurisdiction has explicitly designated the geographic area for improvement or revitalization (e.g., Business Improvement District; Enterprise Zone designation; Promise Zone designation; Choice Neighborhoods designation) (optional); \n• An implementing agency or private investor has retained a construction firm to break ground on the improvement or revitalization (optional); and \n• An implementing agency or private investor has secured financing, such as the issuance of bonds, final approval for tax increment financing,  allocation of Low-Income Housing Tax Credit (optional)."]
[null,null,null,null,null,"Binding commitment to donate land",null,null,null,null,null,null,"Yes","n/a",true,false,true,"A report from the Elderly Minority Concentration Analysis Tool (or, where applicable, the certification by the applicant) identifying the location as an area of minority elderly concentration \nAND a justification for locating the project in an area of elderly minority concentration because sufficient, comparable opportunities exist for housing minority elderly households in the income range to be served by the proposed project, outside areas of minority concentration.  For each property claimed as comparable to Section 202, the applicant must provide the following information: Property name and address; Total number of comparable units, and number of comparable units in standard condition in the property; Household type (e.g., elderly, mixed elderly and disabled); Tenure (i.e., rental); Subsidy program; Income range served (as a percentage of area median income); and tenant payment the same as Section 202 or something else (specified). \n\nAND a justification for locating the project in an area of elderly minority concentration because the project is necessary to meet overriding housing needs that cannot be met in that housing market area, and the project is part of a \"revitalizing area.\" The applicant must provide the Revitalization Report from the Analysis Tool, which includes data on indicators of revitalization, such as poverty rates, unemployment rates, and median household income, compared between the 2000 Census and 2012-2016 American Community Survey (ACS). Applicants may use this report to inform their analysis of whether their proposed project is in a revitalizing area. Applicants may also use other sources of data, including local data and local knowledge, when conducting this analysis. \n\nHUD will consider all relevant factors in making a determination that the site is located in a “revitalizing area” but in particular evidence that: \n(i) The neighborhood has demonstrated signs of revitalization, through indicators such as low or declining poverty rates, low or declining violent crime rates or evidence of high or increased educational opportunity, high or increasing median \nhousehold income, high or increasing homeownership rates and/or high or increased employment (required); \n(ii) There is private or public investment in retail, commercial, or housing development that has occurred or will imminently occur in the area which is relevant to improvements in the revitalization indicators above (required); \n(iii) Evidence of new or improved retail centers, grocery stores, pharmacies, healthcare facilities, community centers, educational and recreational facilities, municipal services, and transportation serving the neighborhood (optional); \n(iv) Evidence of private and public investment or housing development that has occurred or will imminently occur in the area (optional); \n(v) Evidence of improvement of economic conditions without the disproportionate displacement of low- and moderate-income or minority residents (optional); and \n(vi) Evidence of improvements in the area that bring about or preserve a mix of incomes among area residents; a mix of residential unit bedroom sizes; and the availability of accessible housing for persons with a disability. "]
[null,null,null,null,null,"Binding commitment to defer developer fee",null,null,null,null,null,null,"Yes","n/a",true,false,false,"A report from the Elderly Minority Concentration Analysis Tool (or, where applicable, the certification by the applicant) identifying the location as an area of minority elderly concentration \nAND a justification for locating the project in an area of elderly minority concentration because sufficient, comparable opportunities exist for housing minority elderly households in the income range to be served by the proposed project, outside areas of minority concentration.  For each property claimed as comparable to Section 202, the applicant must provide the following information: Property name and address; Total number of comparable units, and number of comparable units in standard condition in the property; Household type (e.g., elderly, mixed elderly and disabled); Tenure (i.e., rental); Subsidy program; Income range served (as a percentage of area median income); and tenant payment the same as Section 202 or something else (specified). "]
[null,null,null,null,null,"Reasonable income from operations (in the context of an occupied rehabilitation project)",null,null,null,null,null,null,"Yes","n/a",false,true,true,"A report from the Elderly Minority Concentration Analysis Tool (or, where applicable, the certification by the applicant) identifying the location as an area of minority elderly concentration \n\n\nAND a justification for locating the project in an area of elderly minority concentration because the project is necessary to meet overriding housing needs that cannot be met in that housing market area, and the project is part of a \"revitalization strategy.\" To establish that a proposed project is an integral part of an overall local strategy for the preservation or restoration of the immediate neighborhood, the applicant must provide evidence demonstrating the following: (i) the proposed project is located in a defined geographic area that is the subject of an official, currently operational and realistically achievable plan for the improvement or revitalization of the immediate neighborhood (which plan may include areas beyond the immediate neighborhood); and (ii) the proposed project conforms to, and the site is integral to, the goals, strategies, and objectives of the improvement or revitalization plan. \n \nHUD will consider any of the following relevant factors for determining whether there is an official, operational, and achievable revitalization plan or strategy: \n• The plan or strategy  has been enacted, adopted, or ratified by a municipal, county, or state legislative body (required); \n• There have been actions to implement the plan or strategy– e.g., public funding approval or expenditures, private funding or financing commitment or expenditures, construction permits, land use changes, site improvements, public infrastructure development, new construction, rehabilitation, financial assistance for job creation, and employment training or employment readiness programs (required). \n• Approaches or activities under the plan are strategy are incorporated in current public, quasi-public agency or major institutional work plans (optional); \n• The plan or strategy  includes objectives and initiatives related to the preservation or restoration of a geography larger than the proposed project site (required); \n• A jurisdiction has published solicitations or incentives for development projects in the improvement or revitalization area (optional); \n• The specific plan or strategy is incorporated in the applicable jurisdiction’s Consolidated Plan or other comprehensive community development plan (optional); \n• A jurisdiction has explicitly designated the geographic area for improvement or revitalization (e.g., Business Improvement District; Enterprise Zone designation; Promise Zone designation; Choice Neighborhoods designation) (optional); \n• An implementing agency or private investor has retained a construction firm to break ground on the improvement or revitalization (optional); and \n• An implementing agency or private investor has secured financing, such as the issuance of bonds, final approval for tax increment financing,  allocation of Low-Income Housing Tax Credit (optional). \n\n\nAND a justification for locating the project in an area of elderly minority concentration because the project is necessary to meet overriding housing needs that cannot be met in that housing market area, and the project is part of a \"revitalizing area.\" The applicant must provide the Revitalization Report from the Analysis Tool, which includes data on indicators of revitalization, such as poverty rates, unemployment rates, and median household income, compared between the 2000 Census and 2012-2016 American Community Survey (ACS). Applicants may use this report to inform their analysis of whether their proposed project is in a revitalizing area. Applicants may also use other sources of data, including local data and local knowledge, when conducting this analysis. \n\nHUD will consider all relevant factors in making a determination that the site is located in a “revitalizing area” but in particular evidence that: \n(i) The neighborhood has demonstrated signs of revitalization, through indicators such as low or declining poverty rates, low or declining violent crime rates or evidence of high or increased educational opportunity, high or increasing median \nhousehold income, high or increasing homeownership rates and/or high or increased employment (required); \n(ii) There is private or public investment in retail, commercial, or housing development that has occurred or will imminently occur in the area which is relevant to improvements in the revitalization indicators above (required); \n(iii) Evidence of new or improved retail centers, grocery stores, pharmacies, healthcare facilities, community centers, educational and recreational facilities, municipal services, and transportation serving the neighborhood (optional); \n(iv) Evidence of private and public investment or housing development that has occurred or will imminently occur in the area (optional); \n(v) Evidence of improvement of economic conditions without the disproportionate displacement of low- and moderate-income or minority residents (optional); and \n(vi) Evidence of improvements in the area that bring about or preserve a mix of incomes among area residents; a mix of residential unit bedroom sizes; and the availability of accessible housing for persons with a disability. "]
[null,null,null,null,null,"A pricing letter from an investor for an anticipated 4% LIHTC approval with proof of eligibility to submit and bond approval date within project timeline",null,null,null,null,null,null,"Yes","n/a",false,true,false,"A report from the Elderly Minority Concentration Analysis Tool (or, where applicable, the certification by the applicant) identifying the location as an area of minority elderly concentration \nAND a justification for locating the project in an area of elderly minority concentration because the project is necessary to meet overriding housing needs that cannot be met in that housing market area, and the project is part of a \"revitalization strategy.\" To establish that a proposed project is an integral part of an overall local strategy for the preservation or restoration of the immediate neighborhood, the applicant must provide evidence demonstrating the following: (i) the proposed project is located in a defined geographic area that is the subject of an official, currently operational and realistically achievable plan for the improvement or revitalization of the immediate neighborhood (which plan may include areas beyond the immediate neighborhood); and (ii) the proposed project conforms to, and the site is integral to, the goals, strategies, and objectives of the improvement or revitalization plan. \n \nHUD will consider any of the following relevant factors for determining whether there is an official, operational, and achievable revitalization plan or strategy: \n• The plan or strategy  has been enacted, adopted, or ratified by a municipal, county, or state legislative body (required); \n• There have been actions to implement the plan or strategy– e.g., public funding approval or expenditures, private funding or financing commitment or expenditures, construction permits, land use changes, site improvements, public infrastructure development, new construction, rehabilitation, financial assistance for job creation, and employment training or employment readiness programs (required). \n• Approaches or activities under the plan are strategy are incorporated in current public, quasi-public agency or major institutional work plans (optional); \n• The plan or strategy  includes objectives and initiatives related to the preservation or restoration of a geography larger than the proposed project site (required); \n• A jurisdiction has published solicitations or incentives for development projects in the improvement or revitalization area (optional); \n• The specific plan or strategy is incorporated in the applicable jurisdiction’s Consolidated Plan or other comprehensive community development plan (optional); \n• A jurisdiction has explicitly designated the geographic area for improvement or revitalization (e.g., Business Improvement District; Enterprise Zone designation; Promise Zone designation; Choice Neighborhoods designation) (optional); \n• An implementing agency or private investor has retained a construction firm to break ground on the improvement or revitalization (optional); and \n• An implementing agency or private investor has secured financing, such as the issuance of bonds, final approval for tax increment financing,  allocation of Low-Income Housing Tax Credit (optional). "]
[null,null,null,null,null,"A loan offer with reasonable terms",null,null,null,null,null,null,"Yes","n/a",false,false,true,"A report from the Elderly Minority Concentration Analysis Tool (or, where applicable, the certification by the applicant) identifying the location as an area of minority elderly concentration \nAND a justification for locating the project in an area of elderly minority concentration because the project is necessary to meet overriding housing needs that cannot be met in that housing market area, and the project is part of a \"revitalizing area.\" The applicant must provide the Revitalization Report from the Analysis Tool, which includes data on indicators of revitalization, such as poverty rates, unemployment rates, and median household income, compared between the 2000 Census and 2012-2016 American Community Survey (ACS). Applicants may use this report to inform their analysis of whether their proposed project is in a revitalizing area. Applicants may also use other sources of data, including local data and local knowledge, when conducting this analysis. \n\nHUD will consider all relevant factors in making a determination that the site is located in a “revitalizing area” but in particular evidence that: \n(i) The neighborhood has demonstrated signs of revitalization, through indicators such as low or declining poverty rates, low or declining violent crime rates or evidence of high or increased educational opportunity, high or increasing median \nhousehold income, high or increasing homeownership rates and/or high or increased employment (required); \n(ii) There is private or public investment in retail, commercial, or housing development that has occurred or will imminently occur in the area which is relevant to improvements in the revitalization indicators above (required); \n(iii) Evidence of new or improved retail centers, grocery stores, pharmacies, healthcare facilities, community centers, educational and recreational facilities, municipal services, and transportation serving the neighborhood (optional); \n(iv) Evidence of private and public investment or housing development that has occurred or will imminently occur in the area (optional); \n(v) Evidence of improvement of economic conditions without the disproportionate displacement of low- and moderate-income or minority residents (optional); and \n(vi) Evidence of improvements in the area that bring about or preserve a mix of incomes among area residents; a mix of residential unit bedroom sizes; and the availability of accessible housing for persons with a disability. "]
[null,null,null,null,null,"Other",null,null,null,null,null,null,"Yes","n/a",false,false,false,"Warning - if the tool shows your project is in an area of elderly minority concentration, you must provide evidence of an exception."]

{"sheet":"HUD 2023 TDC","index":18,"n_rows":1665,"n_cols":85,"rows_kept":1665,"cut":false,"hidden":true,"merged":[]}
["Region Order","RegionLabel","Spacer","StateName","City","Type","0 Bedrooms, HCC","0 Bedrooms, TDC","1 Bedrooms, HCC","1 Bedrooms, TDC","2 Bedrooms, HCC","2 Bedrooms, TDC","3 Bedrooms, HCC","3 Bedrooms, TDC","4 Bedrooms, HCC","4 Bedrooms, TDC","5 Bedrooms, HCC","5 Bedrooms, TDC","6 Bedrooms, HCC","6 Bedrooms, TDC",null,null,null,null,null,null,null,null,null,null,null,"ALABAMA","ALASKA","ARIZONA","ARKANSAS","CALIFORNIA","COLORADO","CONNECTICUT","DELAWARE","DISTRICT OF COLUMBIA","FLORIDA","GEORGIA","GUAM","HAWAII","IDAHO","ILLINOIS","INDIANA","IOWA","KANSAS","KENTUCKY","LOUISIANA","MAINE","MARYLAND","MASSACHUSETTS","MICHIGAN","MINNESOTA","MISSISSIPPI","MISSOURI","MONTANA","NEBRASKA","NEVADA","NEW HAMPSHIRE","NEW JERSEY","NEW MEXICO","NEW YORK","NORTH CAROLINA","NORTH DAKOTA","OHIO","OKLAHOMA","OREGON","PENNSYLVANIA","PUERTO RICO","RHODE ISLAND","SOUTH CAROLINA","SOUTH DAKOTA","TENNESSEE","TEXAS","UTAH","VERMONT","VIRGIN ISLANDS","VIRGINIA","WASHINGTON","WEST VIRGINIA","WISCONSIN","WYOMING"]
[1,"Region I - Northeast",null,"CONNECTICUT","BRIDGEPORT","Detached/Semi-Detached",139168.63510000001,243545.1116,180618.47649999999,316082.33399999997,215815.81039999999,377677.66810000001,257318.64319999999,450307.62550000002,303580.45270000002,531265.79229999997,333025.91019999998,582795.34279999998,360729.0013,631275.75230000005,null,null,null,null,null,null,null,null,null,null,null,"ANNISTON","ANCHORAGE","FLAGSTAFF","FAYETTEVILLE","BAKERSFIELD","BOULDER","BRIDGEPORT","DOVER","WASHINGTON","DAYTONA BEACH","ALBANY","GUAM","HILO","BOISE","BLOOMINGTON","ANDERSON","BURLINGTON","DODGE CITY","ASHLAND","ALEXANDRIA","AUGUSTA","BALTIMORE","BOSTON","ANN ARBOR","BRAINERD","BILOXI","CAPE GIRARDEAU","BILLINGS","GRAND ISLAND","CARSON CITY","CONCORD","ATLANTIC CITY","ALBUQUERQUE","ALBANY","ASHEVILLE","BISMARCK","AKRON","ARDMORE","BEND","ALLENTOWN","SAN JUAN","NEWPORT","CHARLESTON","ABERDEEN","CHATTANOOGA","ABILENE","OGDEN","BRATTLEBORO","ST. CROIX","ALEXANDRIA","EVERETT","BECKLEY","BELOIT","CASPER"]
[1,"Region I - Northeast",null,"CONNECTICUT","BRIDGEPORT","Row House",116939.6636,204644.41140000001,155462.98670000001,272060.2267,191147.36379999999,334507.88669999997,239776.36859999999,419608.64510000002,289621.03869999998,506836.81760000001,319680.90029999998,559441.57539999997,347788.08260000002,608629.14469999995,null,null,null,null,null,null,null,null,null,null,null,"BIRMINGHAM","FAIRBANKS","KINGMAN","FORT SMITH","EUREKA","COLORADO SPRINGS","HARTFORD","WILMINGTON",null,"FORT MYERS","ATHENS",null,null,"COEUR D'ALENE","CARBONDALE","BLOOMINGTON","CEDAR RAPIDS","FORT SCOTT","BOWLING GREEN","BATON ROUGE","BANGOR","CUMBERLAND","LAWRENCE","BATTLE CREEK","DULUTH","COLUMBUS","COLUMBIA","BUTTE","LINCOLN","ELKO","KEENE","CAMDEN","CLOVIS","BINGHAMTON","CHARLOTTE","FARGO","CANTON","ENID","EUGENE","ALTOONA",null,"PROVIDENCE","COLUMBIA","MITCHELL","COLUMBIA","AMARILLO","PROVO","BURLINGTON","ST. JOHN","ARLINGTON","OLYMPIA","BLUEFIELD","EAU CLAIRE","CHEYENNE"]
[1,"Region I - Northeast",null,"CONNECTICUT","BRIDGEPORT","Walkup",108072.2292,189126.40109999999,149291.2781,261259.7366,189366.87270000001,331392.02720000001,247320.9964,432811.74369999999,308078.73349999997,539137.78359999997,346715.37449999998,606751.90540000005,384777.77480000001,673361.10589999997,null,null,null,null,null,null,null,null,null,null,null,"DOTHAN","JUNEAU","PHOENIX","HOT SPRINGS","FRESNO","DENVER","MERIDEN",null,null,"GAINESVILLE","ATLANTA",null,null,"IDAHO FALLS","CENTRALIA","COLUMBUS","COUNCIL BLUFFS","HAYS","COVINGTON","LAFAYETTE","LEWISTON","HAGERSTOWN","LOWELL","BAY CITY","MANKATO","GREENVILLE","JEFFERSON CITY","GREAT FALLS","NORFOLK","LAS VEGAS","LITTLETON","ELIZABETH","FARMINGTON","BRONX","DURHAM","GRAND FORKS","CINCINNATI","LAWTON","KLAMATH FALLS","ERIE",null,null,"FLORENCE","PIERRE","JACKSON","AUSTIN","SALT LAKE CITY","MONTPELIER","ST. THOMAS","CHARLOTTESVILLE","SEATTLE","CHARLESTON","GREEN BAY","ROCK SPRINGS"]
[1,"Region I - Northeast",null,"CONNECTICUT","BRIDGEPORT","Elevator",119993.80070000001,191990.08410000001,167991.321,268786.1176,215988.8413,345582.15120000002,287985.12170000002,460776.20159999997,359981.40210000001,575970.25199999998,407978.92249999999,652766.28559999994,455976.44270000001,729562.31920000003,null,null,null,null,null,null,null,null,null,null,null,"GADSDEN","KETCHIKAN","PRESCOTT","JONESBORO","LOS ANGELES","DURANGO","NEW BRITAIN",null,null,"JACKSONVILLE","AUGUSTA",null,null,"LEWISTON","CHAMPAIGN","EVANSVILLE","DAVENPORT","KANSAS CITY","FRANKFORT","LAKE CHARLES","PORTLAND","SILVER SPRING","NEW BEDFORD","DETROIT","MINNEAPOLIS","JACKSON","JOPLIN","HELENA","NORTH PLATTE","RENO","MANCHESTER","HACKENSACK","GALLUP","BROOKLYN","FAYETTEVILLE","JAMESTOWN","CLEVELAND","OKLAHOMA CITY","MEDFORD","HARRISBURG",null,null,"GREENVILLE","RAPID CITY","JOHNSON CITY","BEAUMONT","","RUTLAND","","FREDERICKSBURG","SPOKANE","CLARKSBURG","KENOSHA","SHERIDAN"]
[1,"Region I - Northeast",null,"CONNECTICUT","HARTFORD","Detached/Semi-Detached",139852.04569999999,244741.08009999999,181557.39430000001,317725.44010000001,216983.01459999999,379720.2757,258773.31779999999,452853.3063,305341.2157,534347.12730000005,334976.37349999999,586208.65359999996,362875.45299999998,635032.04260000004,null,null,null,null,null,null,null,null,null,null,null,"HUNTSVILLE",null,"TUCSON","LITTLE ROCK","MARYSVILLE","FORT COLLINS","NEW HAVEN",null,null,"LAKELAND","COLUMBUS",null,null,"POCATELLO","CHICAGO","FORT WAYNE","DES MOINES","LIBERAL","LEXINGTON","MONROE","WATERVILLE",null,"PITTSFIELD","FLINT","ROCHESTER","LAUREL","KANSAS CITY","MISSOULA","OMAHA",null,"NASHUA","JERSEY CITY","LAS CRUCES","BUFFALO","GASTONIA","MINOT","COLUMBUS","TULSA","PENDLETON","JOHNSTOWN",null,null,"ROCK HILL","SIOUX FALLS","KNOXVILLE","CORPUS CHRISTI","",null,"","LYNCHBURG","TACOMA","HUNTINGTON","LA CROSSE",""]
[1,"Region I - Northeast",null,"CONNECTICUT","HARTFORD","Row House",117233.0194,205157.78390000001,155960.58050000001,272931.0159,191881.78880000001,335793.13040000002,240923.2844,421615.74770000001,291136.89970000001,509489.57459999999,321397.24070000002,562445.17130000005,349707.50079999998,611988.12639999995,null,null,null,null,null,null,null,null,null,null,null,"MOBILE",null,null,"TEXARKANA","MODESTO","GRAND JUNCTION","NEW LONDON",null,null,"MIAMI","MACON",null,null,"TWIN FALLS","DECATUR","GARY","DUBUQUE","SALINA","LOUISVILLE","NEW ORLEANS",null,null,"SPRINGFIELD","GRAND RAPIDS","SAINT PAUL","MERIDIAN","ROLLA",null,null,null,"PORTSMOUTH","NEW BRUNSWICK","ROSWELL","ELMIRA","GREENSBORO","WILLISTON","DAYTON",null,"PORTLAND","LANCASTER",null,null,"SPARTANBURG","WATERTOWN","MEMPHIS","DALLAS","","","","NEWPORT NEWS","VANCOUVER","MORGANTOWN","MADISON",""]
[1,"Region I - Northeast",null,"CONNECTICUT","HARTFORD","Walkup",108164.33100000001,189287.57930000001,149384.96030000001,261423.68049999999,189442.07459999999,331523.63069999998,247330.5961,432828.54320000001,308071.91710000002,539125.85510000004,346664.83319999999,606663.45810000005,384673.43410000001,673178.50970000005,null,null,null,null,null,null,null,null,null,null,null,"MONTGOMERY",null,null,"WEST MEMPHIS","PALM SPRINGS","GREELEY","STAMFORD",null,null,"ORLANDO","SAVANNAH",null,null,null,"EAST ST. LOUIS","INDIANAPOLIS","FORT DODGE","TOPEKA","OWENSBORO","SHREVEPORT",null,null,"WORCESTER","JACKSON","ST. CLOUD","TUPELO","SPRINGFIELD",null,null,null,null,"NEWARK","SANTA FE","JAMESTOWN","HICKORY",null,"HAMILTON",null,"SALEM","NORRISTOWN",null,null,null,null,"NASHVILLE","EL PASO","","","","NORFOLK","WENATCHEE","PARKERSBURG","MILWAUKEE",""]
[1,"Region I - Northeast",null,"CONNECTICUT","HARTFORD","Elevator",120576.7429,192922.7916,168807.44010000001,270091.90820000001,217038.1372,347261.02470000001,289384.18290000001,463014.6997,361730.22879999998,578768.37459999998,409960.92589999997,655937.49120000005,458191.62300000002,733106.60789999994,null,null,null,null,null,null,null,null,null,null,null,"PHENIX CITY",null,null,null,"REDDING","MONTROSE","WATERBURY",null,null,"PANAMA CITY","VALDOSTA",null,null,null,"GALESBURG","KOKOMO","MASON CITY","WICHITA","PADUCAH",null,null,null,null,"KALAMAZOO",null,null,"ST. JOSEPH",null,null,null,null,"PATERSON",null,"KINGSTON","RALEIGH",null,"LIMA",null,null,"PHILADELPHIA",null,null,null,null,"","FORT WORTH","","","","PETERSBURG","YAKIMA","WHEELING","OSHKOSH",""]
[1,"Region I - Northeast",null,"CONNECTICUT","MERIDEN","Detached/Semi-Detached",136001.56080000001,238002.73130000001,176457.40760000001,308800.4632,210799.63589999999,368899.36290000001,251276.32490000001,439733.56849999999,296408.32799999998,518714.57390000002,325139.66889999999,568994.42059999995,352153.8063,616269.16099999996,null,null,null,null,null,null,null,null,null,null,null,"TUSCALOOSA",null,null,null,"RIVERSIDE","PUEBLO","",null,null,"PENSACOLA",null,null,null,null,"JOLIET","LAFAYETTE","SIOUX CITY",null,null,null,null,null,null,"LANSING",null,null,"ST. LOUIS",null,null,null,null,"TRENTON",null,"NIAGARA FALLS","ROCKY MOUNT",null,"LORAIN",null,null,"PITTSBURGH",null,null,null,null,"","GALVESTON","","","","PORTSMOUTH",null,"","RACINE",""]
[1,"Region I - Northeast",null,"CONNECTICUT","MERIDEN","Row House",114552.62390000001,200467.09179999999,152184.56570000001,266322.99,186996.7482,327244.30930000002,234349.56820000001,410111.74430000002,282938.71740000002,495142.75540000002,312262.9045,546460.08290000004,339666.95449999999,594417.17039999994,null,null,null,null,null,null,null,null,null,null,null,null,null,null,null,"SACRAMENTO",null,"",null,null,"SARASOTA",null,null,null,null,"KANKAKEE","MUNCIE","WATERLOO",null,null,null,null,null,null,"MUSKEGON",null,null,null,null,null,null,null,"VINELAND",null,"PLATTSBURGH","WILMINGTON",null,"MANSFIELD",null,null,"READING",null,null,null,null,"","HOUSTON","","","","RICHMOND",null,"","SUPERIOR",""]
[1,"Region I - Northeast",null,"CONNECTICUT","MERIDEN","Walkup",106040.91800000001,185571.60649999999,146517.96309999999,256406.43549999999,185891.6752,325310.43150000001,242868.73869999999,425020.29269999999,302551.04330000002,529464.32590000005,340536.29129999998,595938.50989999995,377967.4473,661443.03280000004,null,null,null,null,null,null,null,null,null,null,null,null,null,null,null,"SALINAS",null,"",null,null,"TALLAHASSEE",null,null,null,null,"PEORIA","SOUTH BEND",null,null,null,null,null,null,null,"SAGINAW",null,null,null,null,null,null,null,null,null,"POUGHKEEPSIE","WINSTON-SALEM",null,"MARION",null,null,"SCRANTON",null,null,null,null,"","LAREDO","","","","ROANOKE",null,"","WAUSAU",""]
[1,"Region I - Northeast",null,"CONNECTICUT","MERIDEN","Elevator",117269.246,187630.79639999999,164176.94440000001,262683.11499999999,211084.6428,337735.43349999998,281446.19040000002,450313.91139999998,351807.73800000001,562892.38919999998,398715.43640000001,637944.70770000003,445623.1348,712997.02630000003,null,null,null,null,null,null,null,null,null,null,null,null,null,null,null,"SAN BERNADINO",null,"",null,null,"TAMPA",null,null,null,null,"QUINCY","TERRE HAUTE",null,null,null,null,null,null,null,"TRAVERSE CITY",null,null,null,null,null,null,null,null,null,"QUEENS",null,null,"SPRINGFIELD",null,null,"STATE COLLEGE",null,null,null,null,"","LONGVIEW","","","","WINCHESTER",null,"","",""]
[1,"Region I - Northeast",null,"CONNECTICUT","NEW BRITAIN","Detached/Semi-Detached",137885.14009999999,241298.99540000001,178918.4809,313107.34169999999,213754.68410000001,374070.6972,254819.64550000001,445934.37969999999,300602.8235,526054.94110000005,329747.00870000001,577057.26509999996,357155.11910000001,625021.45849999995,null,null,null,null,null,null,null,null,null,null,null,null,null,null,null,"SAN DIEGO",null,"",null,null,null,null,null,null,null,"ROCK ISLAND",null,null,null,null,null,null,null,null,null,null,null,null,null,null,null,null,null,null,"ROCHESTER",null,null,"TOLEDO",null,null,"WILKES-BARRE",null,null,null,null,"","LUBBOCK","","","","",null,"","",""]
[1,"Region I - Northeast",null,"CONNECTICUT","NEW BRITAIN","Row House",116046.19839999999,203080.84729999999,154204.31510000001,269857.5514,189519.01689999999,331658.27970000001,237585.1299,415773.97739999997,286888.3112,502054.54450000002,316636.12150000001,554113.21259999997,344441.23389999999,602772.15930000006,null,null,null,null,null,null,null,null,null,null,null,null,null,null,null,"SAN FRANCISCO",null,"",null,null,null,null,null,null,null,"ROCKFORD",null,null,null,null,null,null,null,null,null,null,null,null,null,null,null,null,null,null,"SCHENECTADY",null,null,"YOUNGSTOWN",null,null,"WILLIAMSPORT",null,null,null,null,"","MIDLAND","","",null,"","","","",""]
[1,"Region I - Northeast",null,"CONNECTICUT","NEW BRITAIN","Walkup",107364.42479999999,187887.74350000001,148335.61240000001,259587.3216,188183.4062,329320.9608,245833.71059999999,430208.99349999998,306238.44219999999,535917.27379999997,344672.52720000001,603176.92260000005,382542.44589999999,669449.28020000004,null,null,null,null,null,null,null,null,null,null,null,null,null,null,null,"SAN JOSE",null,"",null,null,null,null,null,null,null,"SPRINGFIELD",null,null,null,null,null,null,null,null,null,null,null,null,null,null,null,null,null,null,"STATEN ISLAND",null,null,null,null,null,"YORK",null,null,null,null,"","SAN ANGELO","","",null,"","","","",""]
[1,"Region I - Northeast",null,"CONNECTICUT","NEW BRITAIN","Elevator",118891.3017,190226.08559999999,166447.82250000001,266316.51980000001,214004.3432,342406.95409999997,285339.12410000002,456542.60550000001,356673.90529999998,570678.25690000004,404230.42599999998,646768.69110000005,451786.94660000002,722859.12529999996,null,null,null,null,null,null,null,null,null,null,null,null,null,null,null,"SAN LUIS OBISPO",null,"",null,null,null,null,null,null,null,null,null,null,null,null,null,null,null,null,null,null,null,null,null,null,null,null,null,null,"SYRACUSE",null,null,null,null,null,null,null,null,null,null,"","SAN ANTONIO","","",null,"","","","",""]
[1,"Region I - Northeast",null,"CONNECTICUT","NEW HAVEN","Detached/Semi-Detached",135318.1502,236806.7628,175518.48980000001,307157.35700000002,209632.43169999999,366856.75530000002,249821.6502,437187.88780000003,294647.565,515633.2389,323189.20569999999,565581.10990000004,350007.35460000002,612512.87069999997,null,null,null,null,null,null,null,null,null,null,null,null,null,null,null,"SAN MATEO",null,"",null,null,null,null,null,null,null,null,null,null,null,null,null,null,null,null,null,null,null,null,null,null,null,null,null,null,"UTICA",null,null,null,null,null,null,null,null,null,null,"","TYLER","","","",null,"","","",""]
[1,"Region I - Northeast",null,"CONNECTICUT","NEW HAVEN","Row House",114259.2681,199953.71919999999,151686.9718,265452.20069999999,186262.32320000001,325959.06559999997,233202.65239999999,408104.64169999998,281422.85629999998,492489.99849999999,310546.56400000001,543456.48699999996,337747.53629999998,591058.18850000005,null,null,null,null,null,null,null,null,null,null,null,null,null,null,null,"SANTA BARBARA",null,"",null,null,null,null,null,null,null,null,null,null,null,null,null,null,null,null,null,null,null,null,null,null,null,null,null,null,"WATERTOWN",null,null,null,null,null,null,null,null,null,null,"","VICTORIA","","","",null,"","","",""]
[1,"Region I - Northeast",null,"CONNECTICUT","NEW HAVEN","Walkup",105948.8161,185410.4283,146424.28090000001,256242.49170000001,185816.47330000001,325178.82809999998,242859.13889999999,425003.49310000002,302557.85960000003,529476.25430000003,340586.83260000002,596026.9571,378071.788,661625.62899999996,null,null,null,null,null,null,null,null,null,null,null,null,null,null,null,"SANTA CRUZ",null,null,null,null,null,null,null,null,null,null,null,null,null,null,null,null,null,null,null,null,null,null,null,null,null,null,null,null,"YONKERS",null,null,null,null,null,null,null,null,null,null,"","WACO","","","",null,"","","",""]
[1,"Region I - Northeast",null,"CONNECTICUT","NEW HAVEN","Elevator",116686.30379999999,186698.0889,163360.8253,261377.32440000001,210035.3469,336056.56,280047.12910000002,448075.41320000001,350058.91139999998,560094.26659999997,396733.43290000001,634773.50210000004,443407.95449999999,709452.73770000006,null,null,null,null,null,null,null,null,null,null,null,null,null,null,null,"SANTA ROSA",null,null,null,null,null,null,null,null,null,null,null,null,null,null,null,null,null,null,null,null,null,null,null,null,null,null,null,null,null,null,null,null,null,null,null,null,null,null,null,"","WICHITA FALLS","","","",null,"","","",""]
[1,"Region I - Northeast",null,"CONNECTICUT","NEW LONDON","Detached/Semi-Detached",137285.0557,240248.84760000001,178157.4031,311775.45559999999,212860.7622,372506.33380000002,253775.32250000001,444106.81439999997,299385.9572,523925.42509999999,328418.57040000003,574732.49820000003,355727.68849999999,622523.45490000001]
[1,"Region I - Northeast",null,"CONNECTICUT","NEW LONDON","Row House",115446.08900000001,202030.65590000001,153443.23730000001,268525.66529999999,188625.09510000001,330093.91639999999,236540.8069,413946.41210000002,285671.4449,499925.02850000001,315307.68329999998,551788.44570000004,343013.80320000002,600274.1557,null,null,null,null,null,null,null,null,null,null,null,null,null,null,null,"STOCKTON",null,null,null,null,null,null,null,null,null,null,null,null,null,null,null,null,null,null,null,null,null,null,null,null,null,null,null,null,null,null,null,null,null,null,null,null,null,null,null,"","","","","",null,"","","",""]
[1,"Region I - Northeast",null,"CONNECTICUT","NEW LONDON","Walkup",106748.72229999999,186810.2641,147473.62880000001,258078.8504,187075.14170000001,327381.49790000002,244356.0246,427623.0429,304391.3346,532684.83559999999,342579.13860000001,599513.4926,380202.77620000002,665354.85849999997,null,null,null,null,null,null,null,null,null,null,null,null,null,null,null,"SUSANVILLE",null,null,null,null,null,null,null,null,null,null,null,null,null,null,null,null,null,null,null,null,null,null,null,null,null,null,null,null,null,null,null,null,null,null,null,null,null,null,null,"","","","","",null,"","","",""]
[1,"Region I - Northeast",null,"CONNECTICUT","NEW LONDON","Elevator",118371.74490000001,189394.7948,165720.44289999999,265152.71269999997,213069.141,340910.63059999997,284092.18790000002,454547.5074,355115.23499999999,568184.38430000003,402463.93290000001,643942.30220000003,449812.63089999999,719700.22010000004,null,null,null,null,null,null,null,null,null,null,null,null,null,null,null,null,null,null,null,null,null,null,null,null,null,null,null,null,null,null,null,null,null,null,null,null,null,null,null,null,null,null,null,null,null,null,null,null,null,null,null,null,null,null,null,"","","","","",null,"","","",""]
[1,"Region I - Northeast",null,"CONNECTICUT","STAMFORD","Detached/Semi-Detached",143060.79089999999,250356.3841,185807.39350000001,325162.93859999999,222135.8426,388737.72440000001,265020.82689999999,463786.44709999999,312785.3064,547374.28619999997,343173.64679999999,600553.88190000004,371810.17979999998,650667.81460000004,null,null,null,null,null,null,null,null,null,null,null,null,null,null,null,null,null,null,null,null,null,null,null,null,null,null,null,null,null,null,null,null,null,null,null,null,null,null,null,null,null,null,null,null,null,null,null,null,null,null,null,null,null,null,null,"","","","","",null,"","","",""]
[1,"Region I - Northeast",null,"CONNECTICUT","STAMFORD","Row House",119466.6876,209066.70329999999,159107.2671,278437.71740000002,195952.66570000001,342917.16509999998,246401.39430000001,431202.44010000001,297968.73469999997,521445.2856,329009.2058,575766.11010000005,358074.64260000002,626630.62470000004,null,null,null,null,null,null,null,null,null,null,null,null,null,null,null,null,null,null,null,null,null,null,null,null,null,null,null,null,null,null,null,null,null,null,null,null,null,null,null,null,null,null,null,null,null,null,null,null,null,null,null,null,null,null,null,"","","","","",null,"","","",""]
[1,"Region I - Northeast",null,"CONNECTICUT","STAMFORD","Walkup",109933.84600000001,192384.23069999999,151774.13020000001,265604.7279,192400.74789999999,336701.3089,251048.81950000001,439335.43410000001,312672.65639999998,547177.14859999996,351771.96360000002,615600.93629999994,390261.7697,682958.09699999995,null,null,null,null,null,null,null,null,null,null,null,null,null,null,null,null,null,null,null,null,null,null,null,null,null,null,null,null,null,null,null,null,null,null,null,null,null,null,null,null,null,null,null,null,null,null,null,null,null,null,null,null,null,null,null,"","","","","",null,"","","",""]
[1,"Region I - Northeast",null,"CONNECTICUT","STAMFORD","Elevator",123332.9969,197332.79810000001,172666.19570000001,276265.91720000003,221999.39439999999,355199.03639999998,295999.1925,473598.71519999998,369998.99070000002,591998.39399999997,419332.18949999998,670931.51320000004,468665.38819999999,749864.6324,null,null,null,null,null,null,null,null,null,null,null,null,null,null,null,null,null,null,null,null,null,null,null,null,null,null,null,null,null,null,null,null,null,null,null,null,null,null,null,null,null,null,null,null,null,null,null,null,null,null,null,null,null,null,null,"","","","","",null,"","","",""]
[1,"Region I - Northeast",null,"CONNECTICUT","WATERBURY","Detached/Semi-Detached",134676.40270000001,235683.7047,174668.49189999999,305669.86099999998,208601.86850000001,365053.26990000001,248572.1514,435001.2648,293158.75040000002,513027.81329999998,321549.7549,562712.07109999994,348220.41350000002,609385.72380000004,null,null,null,null,null,null,null,null,null,null,null,null,null,null,null,null,null,null,null,null,null,null,null,null,null,null,null,null,null,null,null,null,null,null,null,null,null,null,null,null,null,null,null,null,null,null,null,null,null,null,null,null,null,null,null,"","","","","",null,"","","",""]
[1,"Region I - Northeast",null,"CONNECTICUT","WATERBURY","Row House",113812.5355,199171.93719999999,151057.636,264350.86300000001,185448.14980000001,324534.26209999999,232107.033,406187.30780000001,280056.4926,490098.86190000002,309024.17460000003,540792.30550000002,336074.11190000002,588129.69590000005,null,null,null,null,null,null,null,null,null,null,null,null,null,null,null,null,null,null,null,null,null,null,null,null,null,null,null,null,null,null,null,null,null,null,null,null,null,null,null,null,null,null,null,null,null,null,null,null,null,null,null,null,null,null,null,"","","","","","","",null,"",""]
[1,"Region I - Northeast",null,"CONNECTICUT","WATERBURY","Walkup",105594.914,184791.09950000001,145946.44810000001,255406.28409999999,185224.74,324143.29499999998,242115.49600000001,423702.11800000002,301637.71399999998,527865.99950000003,339565.40899999999,594239.46569999994,376954.12359999999,659669.71629999997,null,null,null,null,null,null,null,null,null,null,null,null,null,null,null,null,null,null,null,null,null,null,null,null,null,null,null,null,null,null,null,null,null,null,null,null,null,null,null,null,null,null,null,null,null,null,null,null,null,null,null,null,null,null,null,"","","","","","","",null,"",""]
[1,"Region I - Northeast",null,"CONNECTICUT","WATERBURY","Elevator",116135.05439999999,185816.08979999999,162589.07610000001,260142.52549999999,209043.09770000001,334468.96139999997,278724.13030000002,445958.6152,348405.163,557448.26910000003,394859.18469999998,631774.70479999995,441313.20640000002,706101.14080000005,null,null,null,null,null,null,null,null,null,null,null,null,null,null,null,null,null,null,null,null,null,null,null,null,null,null,null,null,null,null,null,null,null,null,null,null,null,null,null,null,null,null,null,null,null,null,null,null,null,null,null,null,null,null,null,"","","","","","","",null,"",""]
[1,"Region I - Northeast",null,"MAINE","AUGUSTA","Detached/Semi-Detached",123874.8723,216781.02650000001,160969.0785,281695.8873,192511.25839999999,336894.7022,229774.3187,402105.0576,271255.1347,474696.48560000001,297637.84299999999,520866.22519999999,322526.63660000003,564421.61399999994,null,null,null,null,null,null,null,null,null,null,null,null,null,null,null,null,null,null,null,null,null,null,null,null,null,null,null,null,null,null,null,null,null,null,null,null,null,null,null,null,null,null,null,null,null,null,null,null,null,null,null,null,null,null,null,"","","","","","","",null,"",""]
[1,"Region I - Northeast",null,"MAINE","AUGUSTA","Row House",103010.5551,180268.47150000001,137358.2225,240376.88939999999,169357.53959999999,296375.69449999998,213309.2003,373291.10060000001,258152.87669999999,451767.5343,285112.26270000002,498946.4596,310380.33490000002,543165.58620000002,null,null,null,null,null,null,null,null,null,null,null,null,null,null,null,null,null,null,null,null,null,null,null,null,null,null,null,null,null,null,null,null,null,null,null,null,null,null,null,null,null,null,null,null,null,null,null,null,null,null,null,null,null,null,null,"","","","","","","",null,"",""]
[1,"Region I - Northeast",null,"MAINE","AUGUSTA","Walkup",94512.257500000007,165396.45069999999,130430.72900000001,228253.7758,165275.9583,289232.92700000003,215517.12049999999,377154.9608,268389.74459999998,469682.05290000001,301884.37699999998,528297.65969999996,334840.02899999998,585970.05059999996,null,null,null,null,null,null,null,null,null,null,null,null,null,null,null,null,null,null,null,null,null,null,null,null,null,null,null,null,null,null,null,null,null,null,null,null,null,null,null,null,null,null,null,null,null,null,null,null,null,null,null,null,null,null,null,"","","","","","","",null,"",""]
[1,"Region I - Northeast",null,"MAINE","AUGUSTA","Elevator",106783.0232,170852.83970000001,149496.23250000001,239193.97560000001,192209.4417,307535.11139999999,256279.25570000001,410046.81510000001,320349.06959999999,512558.51899999997,363062.27889999998,580899.65480000002,405775.48810000002,649240.79070000001,null,null,null,null,null,null,null,null,null,null,null,null,null,null,null,null,null,null,null,null,null,null,null,null,null,null,null,null,null,null,null,null,null,null,null,null,null,null,null,null,null,null,null,null,null,null,null,null,null,null,null,null,null,null,null,"","","","","","","",null,"",""]
[1,"Region I - Northeast",null,"MAINE","BANGOR","Detached/Semi-Detached",118740.8846,207796.54810000001,154169.08600000001,269795.90039999998,184266.74119999999,322466.79710000003,219778.3131,384612.04790000001,259344.60010000001,453853.05009999999,284522.21740000002,497913.88030000002,308231.08639999997,539404.40119999996,null,null,null,null,null,null,null,null,null,null,null,null,null,null,null,null,null,null,null,null,null,null,null,null,null,null,null,null,null,null,null,null,null,null,null,null,null,null,null,null,null,null,null,null,null,null,null,null,null,null,null,null,null,null,null,"","","","","","","",null,"",""]
[1,"Region I - Northeast",null,"MAINE","BANGOR","Row House",99436.689199999993,174014.20600000001,132323.52849999999,231566.17490000001,162844.14249999999,284977.24930000002,204544.2323,357952.40649999998,247221.95069999999,432638.41369999998,272933.12959999999,477632.97659999999,296992.91989999998,519737.60989999998,null,null,null,null,null,null,null,null,null,null,null,null,null,null,null,null,null,null,null,null,null,null,null,null,null,null,null,null,null,null,null,null,null,null,null,null,null,null,null,null,null,null,null,null,null,null,null,null,null,null,null,null,null,null,null,null,"","","","","","","","",""]
[1,"Region I - Northeast",null,"MAINE","BANGOR","Walkup",91681.035900000003,160441.81289999999,126608.06050000001,221564.1059,160542.08530000001,280948.64929999999,209567.96840000001,366743.94469999999,261028.56839999999,456799.99479999999,293712.97560000001,513997.70730000001,325898.69990000001,570322.72490000003,null,null,null,null,null,null,null,null,null,null,null,null,null,null,null,null,null,null,null,null,null,null,null,null,null,null,null,null,null,null,null,null,null,null,null,null,null,null,null,null,null,null,null,null,null,null,null,null,null,null,null,null,null,null,null,null,"","","","","","","","",""]
[1,"Region I - Northeast",null,"MAINE","BANGOR","Elevator",102373.02069999999,163796.83559999999,143322.22899999999,229315.5699,184271.43729999999,294834.30410000001,245695.24969999999,393112.40549999999,307119.06219999999,491390.50689999998,348068.27049999998,556909.24109999998,389017.47879999998,622427.9754,null,null,null,null,null,null,null,null,null,null,null,null,null,null,null,null,null,null,null,null,null,null,null,null,null,null,null,null,null,null,null,null,null,null,null,null,null,null,null,null,null,null,null,null,null,null,null,null,null,null,null,null,null,null,null,null,"","","","","","","","",""]
[1,"Region I - Northeast",null,"MAINE","LEWISTON","Detached/Semi-Detached",123791.5384,216635.1923,160791.22829999999,281384.6495,192237.96369999999,336416.43640000001,229363.95209999999,401386.91619999998,270711.22039999999,473744.63569999998,297015.79840000003,519777.6471,321807.5944,563163.29020000005,null,null,null,null,null,null,null,null,null,null,null,null,null,null,null,null,null,null,null,null,null,null,null,null,null,null,null,null,null,null,null,null,null,null,null,null,null,null,null,null,null,null,null,null,null,null,null,null,null,null,null,null,null,null,null,null,"","","","","","","","",""]
[1,"Region I - Northeast",null,"MAINE","LEWISTON","Row House",103317.30349999999,180805.28109999999,137621.69889999999,240837.9731,169517.0269,296654.79700000002,213206.59450000001,373111.5404,257853.86569999999,451244.26500000001,284724.34220000001,498267.59899999999,309888.32750000001,542304.57319999998,null,null,null,null,null,null,null,null,null,null,null,null,null,null,null,null,null,null,null,null,null,null,null,null,null,null,null,null,null,null,null,null,null,null,null,null,null,null,null,null,null,null,null,null,null,null,null,null,null,null,null,null,null,null,null,null,"","","","","","","","",""]
[1,"Region I - Northeast",null,"MAINE","LEWISTON","Walkup",95035.854000000007,166312.74460000001,131199.02470000001,229598.29319999999,166309.01379999999,291040.77429999999,216985.1979,379724.09639999998,270243.65740000003,472926.40059999999,304028.29460000002,532049.51569999999,337284.02590000001,590247.04539999994,null,null,null,null,null,null,null,null,null,null,null,null,null,null,null,null,null,null,null,null,null,null,null,null,null,null,null,null,null,null,null,null,null,null,null,null,null,null,null,null,null,null,null,null,null,null,null,null,null,null,null,null,null,null,null,null,"","","","","","","","",""]
[1,"Region I - Northeast",null,"MAINE","LEWISTON","Elevator",106719.6312,170751.41250000001,149407.48370000001,239051.97750000001,192095.33609999999,307352.54239999998,256127.11489999999,409803.3898,320158.89360000001,512254.23739999998,362846.74609999999,580554.80229999998,405534.59850000002,648855.36730000004,null,null,null,null,null,null,null,null,null,null,null,null,null,null,null,null,null,null,null,null,null,null,null,null,null,null,null,null,null,null,null,null,null,null,null,null,null,null,null,null,null,null,null,null,null,null,null,null,null,null,null,null,null,null,null,null,"","","","","","","","",""]
[1,"Region I - Northeast",null,"MAINE","PORTLAND","Detached/Semi-Detached",124349.9598,217612.42970000001,161463.386,282560.92550000001,192995.24429999999,337741.6777,230203.0992,402855.42379999999,271656.1385,475398.24229999998,298033.22409999999,521558.1422,322875.51449999999,565032.15040000004,null,null,null,null,null,null,null,null,null,null,null,null,null,null,null,null,null,null,null,null,null,null,null,null,null,null,null,null,null,null,null,null,null,null,null,null,null,null,null,null,null,null,null,null,null,null,null,null,null,null,null,null,null,null,null,"","","","","","","","",null,""]
[1,"Region I - Northeast",null,"MAINE","PORTLAND","Row House",104070.78969999999,182123.88209999999,138514.51860000001,242400.40770000001,170490.6972,298358.72019999998,214199.62109999999,374849.337,258921.2346,453112.1606,285858.82929999998,500252.95130000002,311069.76439999999,544372.08770000003,null,null,null,null,null,null,null,null,null,null,null,null,null,null,null,null,null,null,null,null,null,null,null,null,null,null,null,null,null,null,null,null,null,null,null,null,null,null,null,null,null,null,null,null,null,null,null,null,null,null,null,null,null,null,null,"","","","","","","","",null,""]
[1,"Region I - Northeast",null,"MAINE","PORTLAND","Walkup",95913.356899999999,167848.37460000001,132445.15890000001,231779.0281,167933.80970000001,293884.16690000001,219196.92720000001,383594.6225,273017.72700000001,477781.02220000001,307193.6482,537588.88430000003,340845.70069999999,596479.97620000003,null,null,null,null,null,null,null,null,null,null,null,null,null,null,null,null,null,null,null,null,null,null,null,null,null,null,null,null,null,null,null,null,null,null,null,null,null,null,null,null,null,null,null,null,null,null,null,null,null,null,null,null,null,null,null,"","","","","","","","",null,""]
[1,"Region I - Northeast",null,"MAINE","PORTLAND","Elevator",107207.4953,171531.995,150090.4933,240144.79300000001,192973.4914,308757.59080000001,257297.98860000001,411676.78779999999,321622.48570000002,514595.98489999998,364505.48379999999,583208.78280000004,407388.48190000001,651821.58070000005,null,null,null,null,null,null,null,null,null,null,null,null,null,null,null,null,null,null,null,null,null,null,null,null,null,null,null,null,null,null,null,null,null,null,null,null,null,null,null,null,null,null,null,null,null,null,null,null,null,null,null,null,null,null,null,"","","","","","","","",null,""]
[1,"Region I - Northeast",null,"MAINE","WATERVILLE","Detached/Semi-Detached",116340.5434,203595.95079999999,151124.7703,264468.348,180691.04829999999,316209.3345,215601.01490000001,377301.77600000001,254477.1274,445334.973,279208.45659999998,488614.79889999999,302521.3554,529412.37190000003,null,null,null,null,null,null,null,null,null,null,null,null,null,null,null,null,null,null,null,null,null,null,null,null,null,null,null,null,null,null,null,null,null,null,null,null,null,null,null,null,null,null,null,null,null,null,null,null,null,null,null,null,null,null,null,"","","","","","","","",null,""]
[1,"Region I - Northeast",null,"MAINE","WATERVILLE","Row House",97036.247900000002,169813.4338,129279.21279999999,226238.6225,159268.44949999999,278719.7867,200366.93410000001,350642.13459999999,242354.47810000001,424120.33669999999,267619.36869999999,468333.89510000002,291283.1888,509745.58059999999,null,null,null,null,null,null,null,null,null,null,null,null,null,null,null,null,null,null,null,null,null,null,null,null,null,null,null,null,null,null,null,null,null,null,null,null,null,null,null,null,null,null,null,null,null,null,null,null,null,null,null,null,null,null,null,"","","","","","","","",null,""]
[1,"Region I - Northeast",null,"MAINE","WATERVILLE","Walkup",89218.222200000004,156131.88879999999,123160.12119999999,215530.21220000001,156109.02050000001,273190.78580000001,203657.21539999999,356400.12680000003,253640.12710000001,443870.22249999997,285339.40879999998,499343.96539999999,316540.00760000001,553945.01340000005,null,null,null,null,null,null,null,null,null,null,null,null,null,null,null,null,null,null,null,null,null,null,null,null,null,null,null,null,null,null,null,null,null,null,null,null,null,null,null,null,null,null,null,null,null,null,null,null,null,null,null,null,null,null,null,"","","","","","","","",null,""]
[1,"Region I - Northeast",null,"MAINE","WATERVILLE","Elevator",100294.79059999999,160471.66740000001,140412.70680000001,224660.33429999999,180530.62299999999,288849.0012,240707.49729999999,385132.00150000001,300884.37170000002,481415.00189999997,341002.288,545603.66879999998,381120.20419999998,609792.33570000005,null,null,null,null,null,null,null,null,null,null,null,null,null,null,null,null,null,null,null,null,null,null,null,null,null,null,null,null,null,null,null,null,null,null,null,null,null,null,null,null,null,null,null,null,null,null,null,null,null,null,null,null,null,null,null,"","","","","","","","",null,""]
[1,"Region I - Northeast",null,"MASSACHUSETTS","BOSTON","Detached/Semi-Detached",151670.28829999999,265423.00449999998,196907.08240000001,344587.39419999998,235333.9552,411834.4216,280667.22810000001,491167.64919999999,331181.1765,579567.05889999995,363326.84470000002,635821.97809999995,393591.761,688785.58189999999,null,null,null,null,null,null,null,null,null,null,null,null,null,null,null,null,null,null,null,null,null,null,null,null,null,null,null,null,null,null,null,null,null,null,null,null,null,null,null,null,null,null,null,null,null,null,null,null,null,null,null,null,null,null,null,"","","","","","","","",null,""]
[1,"Region I - Northeast",null,"MASSACHUSETTS","BOSTON","Row House",127101.33530000001,222427.33679999999,169103.64610000001,295931.38069999998,208068.83,364120.45250000001,261278.3983,457237.19699999999,315752.35029999999,552566.61309999996,348577.0968,610009.91929999995,379288.64030000003,663755.12049999996,null,null,null,null,null,null,null,null,null,null,null,null,null,null,null,null,null,null,null,null,null,null,null,null,null,null,null,null,null,null,null,null,null,null,null,null,null,null,null,null,null,null,null,null,null,null,null,null,null,null,null,null,null,null,null,"","","","","","","","",null,""]
[1,"Region I - Northeast",null,"MASSACHUSETTS","BOSTON","Walkup",117244.67969999999,205178.1894,161921.14629999999,283362.0061,205333.79509999999,359334.14140000002,268066.20860000001,469115.8651,333897.35279999999,584320.36730000004,375719.57919999998,657509.2635,416907.11829999997,729587.4571,null,null,null,null,null,null,null,null,null,null,null,null,null,null,null,null,null,null,null,null,null,null,null,null,null,null,null,null,null,null,null,null,null,null,null,null,null,null,null,null,null,null,null,null,null,null,null,null,null,null,null,null,null,null,null,"","","","","","","","",null,""]
[1,"Region I - Northeast",null,"MASSACHUSETTS","BOSTON","Elevator",130765.2553,209224.41149999999,183071.35740000001,292914.17619999999,235377.45939999999,376603.94069999998,313836.61259999999,502138.58760000003,392295.76579999999,627673.23459999997,444601.86780000001,711362.99910000002,496907.96990000003,795052.76379999996,null,null,null,null,null,null,null,null,null,null,null,null,null,null,null,null,null,null,null,null,null,null,null,null,null,null,null,null,null,null,null,null,null,null,null,null,null,null,null,null,null,null,null,null,null,null,null,null,null,null,null,null,null,null,null,"",null,"","","","","","","",""]
[1,"Region I - Northeast",null,"MASSACHUSETTS","LAWRENCE","Detached/Semi-Detached",139852.04569999999,244741.08009999999,181557.39430000001,317725.44010000001,216983.01459999999,379720.2757,258773.31779999999,452853.3063,305341.2157,534347.12730000005,334976.37349999999,586208.65359999996,362875.45299999998,635032.04260000004,null,null,null,null,null,null,null,null,null,null,null,null,null,null,null,null,null,null,null,null,null,null,null,null,null,null,null,null,null,null,null,null,null,null,null,null,null,null,null,null,null,null,null,null,null,null,null,null,null,null,null,null,null,null,null,"",null,"","","","","","","",""]
[1,"Region I - Northeast",null,"MASSACHUSETTS","LAWRENCE","Row House",117233.0194,205157.78390000001,155960.58050000001,272931.0159,191881.78880000001,335793.13040000002,240923.2844,421615.74770000001,291136.89970000001,509489.57459999999,321397.24070000002,562445.17130000005,349707.50079999998,611988.12639999995,null,null,null,null,null,null,null,null,null,null,null,null,null,null,null,null,null,null,null,null,null,null,null,null,null,null,null,null,null,null,null,null,null,null,null,null,null,null,null,null,null,null,null,null,null,null,null,null,null,null,null,null,null,null,null,"",null,"","","","","","","",""]
[1,"Region I - Northeast",null,"MASSACHUSETTS","LAWRENCE","Walkup",108164.33100000001,189287.57930000001,149384.96030000001,261423.68049999999,189442.07459999999,331523.63069999998,247330.5961,432828.54320000001,308071.91710000002,539125.85510000004,346664.83319999999,606663.45810000005,384673.43410000001,673178.50970000005,null,null,null,null,null,null,null,null,null,null,null,null,null,null,null,null,null,null,null,null,null,null,null,null,null,null,null,null,null,null,null,null,null,null,null,null,null,null,null,null,null,null,null,null,null,null,null,null,null,null,null,null,null,null,null,"",null,"","","","","","","",""]
[1,"Region I - Northeast",null,"MASSACHUSETTS","LAWRENCE","Elevator",120576.7429,192922.7916,168807.44010000001,270091.90820000001,217038.1372,347261.02470000001,289384.18290000001,463014.6997,361730.22879999998,578768.37459999998,409960.92589999997,655937.49120000005,458191.62300000002,733106.60789999994,null,null,null,null,null,null,null,null,null,null,null,null,null,null,null,null,null,null,null,null,null,null,null,null,null,null,null,null,null,null,null,null,null,null,null,null,null,null,null,null,null,null,null,null,null,null,null,null,null,null,null,null,null,null,null,"",null,"","","","","","","",""]
[1,"Region I - Northeast",null,"MASSACHUSETTS","LOWELL","Detached/Semi-Detached",139852.04569999999,244741.08009999999,181557.39430000001,317725.44010000001,216983.01459999999,379720.2757,258773.31779999999,452853.3063,305341.2157,534347.12730000005,334976.37349999999,586208.65359999996,362875.45299999998,635032.04260000004,null,null,null,null,null,null,null,null,null,null,null,null,null,null,null,null,null,null,null,null,null,null,null,null,null,null,null,null,null,null,null,null,null,null,null,null,null,null,null,null,null,null,null,null,null,null,null,null,null,null,null,null,null,null,null,"",null,"","","","","","","",""]
[1,"Region I - Northeast",null,"MASSACHUSETTS","LOWELL","Row House",117233.0194,205157.78390000001,155960.58050000001,272931.0159,191881.78880000001,335793.13040000002,240923.2844,421615.74770000001,291136.89970000001,509489.57459999999,321397.24070000002,562445.17130000005,349707.50079999998,611988.12639999995,null,null,null,null,null,null,null,null,null,null,null,null,null,null,null,null,null,null,null,null,null,null,null,null,null,null,null,null,null,null,null,null,null,null,null,null,null,null,null,null,null,null,null,null,null,null,null,null,null,null,null,null,null,null,null,"",null,"","","","","","","",""]
[1,"Region I - Northeast",null,"MASSACHUSETTS","LOWELL","Walkup",108164.33100000001,189287.57930000001,149384.96030000001,261423.68049999999,189442.07459999999,331523.63069999998,247330.5961,432828.54320000001,308071.91710000002,539125.85510000004,346664.83319999999,606663.45810000005,384673.43410000001,673178.50970000005,null,null,null,null,null,null,null,null,null,null,null,null,null,null,null,null,null,null,null,null,null,null,null,null,null,null,null,null,null,null,null,null,null,null,null,null,null,null,null,null,null,null,null,null,null,null,null,null,null,null,null,null,null,null,null,"",null,"","","","","","","",""]
[1,"Region I - Northeast",null,"MASSACHUSETTS","LOWELL","Elevator",120576.7429,192922.7916,168807.44010000001,270091.90820000001,217038.1372,347261.02470000001,289384.18290000001,463014.6997,361730.22879999998,578768.37459999998,409960.92589999997,655937.49120000005,458191.62300000002,733106.60789999994,null,null,null,null,null,null,null,null,null,null,null,null,null,null,null,null,null,null,null,null,null,null,null,null,null,null,null,null,null,null,null,null,null,null,null,null,null,null,null,null,null,null,null,null,null,null,null,null,null,null,null,null,null,null,null,"",null,"","","","","","","",""]
[1,"Region I - Northeast",null,"MASSACHUSETTS","NEW BEDFORD","Detached/Semi-Detached",137410.03779999999,240467.5662,178424.15419999999,312242.2697,213270.6752,373223.68160000001,254390.83749999999,445183.9657,300201.78749999998,525353.12809999997,329351.59220000001,576365.28630000004,356806.20289999997,624410.85510000004,null,null,null,null,null,null,null,null,null,null,null,null,null,null,null,null,null,null,null,null,null,null,null,null,null,null,null,null,null,null,null,null,null,null,null,null,null,null,null,null,null,null,null,null,null,null,null,null,null,null,null,null,null,null,null,"",null,"","","","","","","",""]
[1,"Region I - Northeast",null,"MASSACHUSETTS","NEW BEDFORD","Row House",114985.95140000001,201225.4149,153048.00229999999,267834.00410000002,188385.83910000001,329675.21830000001,236694.68359999999,414215.69620000001,286119.92249999999,500709.86440000002,315889.5209,552806.66150000005,343751.76740000001,601565.59310000006,null,null,null,null,null,null,null,null,null,null,null,null,null,null,null,null,null,null,null,null,null,null,null,null,null,null,null,null,null,null,null,null,null,null,null,null,null,null,null,null,null,null,null,null,null,null,null,null,null,null,null,null,null,null,null,"",null,"","","","","","","",""]
[1,"Region I - Northeast",null,"MASSACHUSETTS","NEW BEDFORD","Walkup",105963.31389999999,185435.79930000001,146321.16649999999,256062.04139999999,185525.53460000001,324669.68540000002,242153.8774,423769.2855,301610.42670000001,527818.24679999996,339363.21889999998,593885.63300000003,376536.7329,658939.28260000004,null,null,null,null,null,null,null,null,null,null,null,null,null,null,null,null,null,null,null,null,null,null,null,null,null,null,null,null,null,null,null,null,null,null,null,null,null,null,null,null,null,null,null,null,null,null,null,null,null,null,null,null,null,null,null,"",null,"","","","","","","",""]
[1,"Region I - Northeast",null,"MASSACHUSETTS","NEW BEDFORD","Elevator",118466.81690000001,189546.91,165853.54370000001,265365.67389999999,213240.27050000001,341184.43780000001,284320.36060000001,454912.58370000002,355400.45079999999,568640.72970000003,402787.1776,644459.49369999999,450173.90429999999,720278.25769999996,null,null,null,null,null,null,null,null,null,null,null,null,null,null,null,null,null,null,null,null,null,null,null,null,null,null,null,null,null,null,null,null,null,null,null,null,null,null,null,null,null,null,null,null,null,null,null,null,null,null,null,null,null,null,null,"",null,"","","","","","","",""]
[1,"Region I - Northeast",null,"MASSACHUSETTS","PITTSFIELD","Detached/Semi-Detached",129275.6357,226232.36240000001,167818.78289999999,293682.8701,200556.56080000001,350973.98139999999,239173.23190000001,418553.15580000001,282206.93890000001,493862.14319999999,309593.79499999998,541789.14119999995,335373.5208,586903.66150000005,null,null,null,null,null,null,null,null,null,null,null,null,null,null,null,null,null,null,null,null,null,null,null,null,null,null,null,null,null,null,null,null,null,null,null,null,null,null,null,null,null,null,null,null,null,null,null,null,null,null,null,null,null,null,null,"",null,"","","","","","","",""]
[1,"Region I - Northeast",null,"MASSACHUSETTS","PITTSFIELD","Row House",108411.5436,189720.20129999999,144207.92689999999,252363.87220000001,177402.84210000001,310454.97360000003,222708.11360000001,389739.19870000001,269104.68109999999,470933.19179999997,297068.21470000001,519869.37569999998,323227.21919999999,565647.63359999994,null,null,null,null,null,null,null,null,null,null,null,null,null,null,null,null,null,null,null,null,null,null,null,null,null,null,null,null,null,null,null,null,null,null,null,null,null,null,null,null,null,null,null,null,null,null,null,null,null,null,null,null,null,null,null,"",null,"","","","","","","",""]
[1,"Region I - Northeast",null,"MASSACHUSETTS","PITTSFIELD","Walkup",100053.584,175093.77179999999,138188.58600000001,241830.02549999999,175250.34589999999,306688.10519999999,228816.30379999999,400428.5318,285013.72379999998,498774.01659999997,320724.88679999998,561268.55180000002,355897.06929999997,622819.87120000005,null,null,null,null,null,null,null,null,null,null,null,null,null,null,null,null,null,null,null,null,null,null,null,null,null,null,null,null,null,null,null,null,null,null,null,null,null,null,null,null,null,null,null,null,null,null,null,null,null,null,null,null,null,null,null,"",null,"","","","","","","",""]
[1,"Region I - Northeast",null,"MASSACHUSETTS","PITTSFIELD","Elevator",111459.03720000001,178334.46230000001,156042.65210000001,249668.24710000001,200626.26689999999,321002.0319,267501.68930000003,428002.70919999998,334377.1116,535003.38659999997,378960.72649999999,606337.17139999999,423544.34139999998,677670.95629999996,null,null,null,null,null,null,null,null,null,null,null,null,null,null,null,null,null,null,null,null,null,null,null,null,null,null,null,null,null,null,null,null,null,null,null,null,null,null,null,null,null,null,null,null,null,null,null,null,null,null,null,null,null,null,null,"",null,"","","","","","","",""]
[1,"Region I - Northeast",null,"MASSACHUSETTS","SPRINGFIELD","Detached/Semi-Detached",136809.9534,239417.4184,177663.07639999999,310910.3836,212376.75339999999,371659.31839999999,253346.51449999999,443356.40049999999,298984.92119999998,523223.61200000002,328023.15399999998,574040.51939999999,355378.77230000001,621912.85140000004,null,null,null,null,null,null,null,null,null,null,null,null,null,null,null,null,null,null,null,null,null,null,null,null,null,null,null,null,null,null,null,null,null,null,null,null,null,null,null,null,null,null,null,null,null,null,null,null,null,null,null,null,null,null,null,"",null,"","","","","","","",""]
[1,"Region I - Northeast",null,"MASSACHUSETTS","SPRINGFIELD","Row House",114385.842,200175.22339999999,152286.92449999999,266502.11800000002,187491.9172,328110.85509999999,235650.36060000001,412388.13099999999,284903.05619999999,498580.34830000001,314561.08260000002,550481.89450000005,342324.33689999999,599067.58940000006,null,null,null,null,null,null,null,null,null,null,null,null,null,null,null,null,null,null,null,null,null,null,null,null,null,null,null,null,null,null,null,null,null,null,null,null,null,null,null,null,null,null,null,null,null,null,null,null,null,null,null,null,null,null,null,"",null,"","","","","","","",""]
[1,"Region I - Northeast",null,"MASSACHUSETTS","SPRINGFIELD","Walkup",105347.61139999999,184358.32,145459.18299999999,254553.57019999999,184417.27,322730.22249999997,240676.19140000001,421183.33480000001,299763.31920000003,524585.80859999999,337269.83020000003,590222.20290000003,374197.06339999998,654844.86089999997,null,null,null,null,null,null,null,null,null,null,null,null,null,null,null,null,null,null,null,null,null,null,null,null,null,null,null,null,null,null,null,null,null,null,null,null,null,null,null,null,null,null,null,null,null,null,null,null,null,null,null,null,null,null,null,"",null,"","","","","","","",""]
[1,"Region I - Northeast",null,"MASSACHUSETTS","SPRINGFIELD","Elevator",117947.2602,188715.61910000001,165126.1643,264201.86670000001,212305.06830000001,339688.11430000002,283073.42430000001,452917.48570000002,353841.78049999999,566146.85719999997,401020.68459999998,641633.10479999997,448199.58860000002,717119.35250000004,null,null,null,null,null,null,null,null,null,null,null,null,null,null,null,null,null,null,null,null,null,null,null,null,null,null,null,null,null,null,null,null,null,null,null,null,null,null,null,null,null,null,null,null,null,null,null,null,null,null,null,null,null,null,null,"","",null,"","","","","","",""]
[1,"Region I - Northeast",null,"MASSACHUSETTS","WORCESTER","Detached/Semi-Detached",136684.9713,239198.69990000001,177396.3254,310443.56949999998,211966.84030000001,370941.9706,252730.99950000001,442279.24910000002,298169.09080000001,521795.90899999999,327090.1323,572407.73140000005,354300.25780000002,620025.45129999996,null,null,null,null,null,null,null,null,null,null,null,null,null,null,null,null,null,null,null,null,null,null,null,null,null,null,null,null,null,null,null,null,null,null,null,null,null,null,null,null,null,null,null,null,null,null,null,null,null,null,null,null,null,null,null,"","",null,"","","","","","",""]
[1,"Region I - Northeast",null,"MASSACHUSETTS","WORCESTER","Row House",114845.97960000001,200980.46429999999,152682.15950000001,267193.77919999999,187731.17310000001,328529.55310000002,235496.48389999999,412118.8468,284454.5785,497795.51240000001,313979.2451,549463.67879999999,341586.3726,597776.15209999995,null,null,null,null,null,null,null,null,null,null,null,null,null,null,null,null,null,null,null,null,null,null,null,null,null,null,null,null,null,null,null,null,null,null,null,null,null,null,null,null,null,null,null,null,null,null,null,null,null,null,null,null,null,null,null,"","",null,"","","","","","",""]
[1,"Region I - Northeast",null,"MASSACHUSETTS","WORCESTER","Walkup",106133.01979999999,185732.78460000001,146611.6453,256570.3792,185966.87710000001,325442.03490000003,242878.33850000001,425037.09220000001,302544.22700000001,529452.39729999995,340485.75,595850.06259999995,377863.1066,661260.43669999996,null,null,null,null,null,null,null,null,null,null,null,null,null,null,null,null,null,null,null,null,null,null,null,null,null,null,null,null,null,null,null,null,null,null,null,null,null,null,null,null,null,null,null,null,null,null,null,null,null,null,null,null,null,null,null,"","",null,"","","","","",""]
[1,"Region I - Northeast",null,"MASSACHUSETTS","WORCESTER","Elevator",117852.1882,188563.50399999999,164993.06349999999,263988.90549999999,212133.9388,339414.30709999998,282845.25160000002,452552.4094,353556.56469999999,565690.51179999998,400697.4399,641115.91339999996,447838.31510000001,716541.31499999994,null,null,null,null,null,null,null,null,null,null,null,null,null,null,null,null,null,null,null,null,null,null,null,null,null,null,null,null,null,null,null,null,null,null,null,null,null,null,null,null,null,null,null,null,null,null,null,null,null,null,null,null,null,null,null,"","","","","","","","",""]
[1,"Region I - Northeast",null,"NEW HAMPSHIRE","CONCORD","Detached/Semi-Detached",121616.3172,212828.55530000001,157707.71419999999,275988.4999,188326.42619999999,329571.24589999998,224384.39939999999,392672.69890000002,264613.08529999998,463072.89929999999,290231.36910000001,507904.8958,314289.70600000001,550006.98549999995,null,null,null,null,null,null,null,null,null,null,null,null,null,null,null,null,null,null,null,null,null,null,null,null,null,null,null,null,null,null,null,null,null,null,null,null,null,null,null,null,null,null,null,null,null,null,null,null,null,null,null,null,null,null,null,"","","","","","","","",""]
[1,"Region I - Northeast",null,"NEW HAMPSHIRE","CONCORD","Row House",102897.36780000001,180070.39360000001,136524.1441,238917.25210000001,167552.99780000001,293217.74609999999,209611.95790000001,366820.92619999999,252857.7893,442501.13130000001,278993.46610000002,488238.56559999997,303392.09039999999,530936.15819999995,null,null,null,null,null,null,null,null,null,null,null,null,null,null,null,null,null,null,null,null,null,null,null,null,null,null,null,null,null,null,null,null,null,null,null,null,null,null,null,null,null,null,null,null,null,null,null,null,null,null,null,null,null,null,null,"","","","","","","","",""]
[1,"Region I - Northeast",null,"NEW HAMPSHIRE","CONCORD","Walkup",95544.951199999996,167203.66459999999,132070.4325,231123.25690000001,167633.005,293357.75870000001,219158.53260000001,383527.43190000003,273044.99770000001,477828.74599999998,307395.8198,537942.68460000004,341263.07069999998,597210.3737]
[1,"Region I - Northeast",null,"NEW HAMPSHIRE","CONCORD","Elevator",104875.72629999999,167801.16450000001,146826.01680000001,234921.63029999999,188776.30720000001,302042.09600000002,251701.74299999999,402722.79479999997,314627.17879999999,503403.49349999998,356577.4693,570523.95920000004,398527.7597,637644.42500000005]
[1,"Region I - Northeast",null,"NEW HAMPSHIRE","KEENE","Detached/Semi-Detached",117457.38959999999,205550.43179999999,152469.09039999999,266820.9081,182205.61489999999,318859.82620000001,217279.31539999999,380238.80200000003,256366.97080000001,448642.19890000002,281243.31589999999,492175.8027,304657.20419999998,533150.10730000003]
[1,"Region I - Northeast",null,"NEW HAMPSHIRE","KEENE","Row House",98543.223899999997,172450.64189999999,131064.8569,229363.49960000001,161215.79560000001,282127.6422,202352.99350000001,354117.73869999999,244489.22330000001,427856.14069999999,269888.35080000001,472304.61379999999,293646.0711,513880.62449999998]
[1,"Region I - Northeast",null,"NEW HAMPSHIRE","KEENE","Walkup",90973.231599999999,159203.15530000001,125652.39479999999,219891.69089999999,159358.61869999999,278877.58289999998,208080.6826,364141.19449999998,259188.27720000001,453579.48509999999,291670.12829999998,510422.72460000002,323663.37109999999,566410.89930000005]
[1,"Region I - Northeast",null,"NEW HAMPSHIRE","KEENE","Elevator",101270.5217,162032.83730000001,141778.73050000001,226845.97210000001,182286.93909999999,291659.10700000002,243049.25219999999,388878.80940000003,303811.56530000002,486098.51179999998,344319.77399999998,550911.64659999998,384827.98269999999,615724.78150000004]
[1,"Region I - Northeast",null,"NEW HAMPSHIRE","LITTLETON","Detached/Semi-Detached",117974.1441,206454.75210000001,153052.323,267841.56520000001,182826.24830000001,319945.93449999997,217913.27929999999,381348.2389,257039.93169999999,449819.88050000003,281949.7193,493412.00870000001,305365.60320000001,534389.80570000003]
[1,"Region I - Northeast",null,"NEW HAMPSHIRE","LITTLETON","Row House",99450.084400000007,174037.64780000001,132089.4148,231156.47589999999,162269.2095,283971.11670000001,203294.71720000001,355765.75510000001,245407.08670000001,429462.40159999998,270828.87760000001,473950.53580000001,294581.50429999997,515517.63250000001]
[1,"Region I - Northeast",null,"NEW HAMPSHIRE","LITTLETON","Walkup",92112.532699999996,161196.93229999999,127282.67690000001,222744.6845,161499.9424,282624.89919999999,211026.45060000001,369296.28840000002,262889.30310000002,460056.2806,295907.44069999998,517838.02120000002,328447.04430000001,574782.32750000001]
[1,"Region I - Northeast",null,"NEW HAMPSHIRE","LITTLETON","Elevator",101726.68979999999,162762.70619999999,142417.36569999999,227867.7886,183108.0416,292972.87109999999,244144.05549999999,390630.49469999998,305180.06949999998,488288.11839999998,345870.74540000001,553393.20090000005,386561.42139999999,618498.28330000001]
[1,"Region I - Northeast",null,"NEW HAMPSHIRE","MANCHESTER","Detached/Semi-Detached",125466.8061,219566.91070000001,162807.70610000001,284913.48560000001,194509.81099999999,340392.16930000001,231881.39980000001,405792.4497,273545.98180000001,478705.4681,300068.0834,525119.14599999995,325011.36330000003,568769.88580000005]
[1,"Region I - Northeast",null,"NEW HAMPSHIRE","MANCHESTER","Row House",105577.7659,184761.09030000001,140300.16269999999,245525.28460000001,172438.04319999999,301766.57569999999,216185.68059999999,378324.9411,261055.9798,456847.96460000001,288127.81140000001,504223.67,313432.64669999998,548507.13170000003]
[1,"Region I - Northeast",null,"NEW HAMPSHIRE","MANCHESTER","Walkup",97668.366299999994,170919.64110000001,134937.4325,236140.50690000001,171183.408,299570.96399999998,223620.39439999999,391335.69020000001,278565.87699999998,487490.28480000002,313524.3677,548667.64359999995,347969.06410000002,608945.86210000003]
[1,"Region I - Northeast",null,"NEW HAMPSHIRE","MANCHESTER","Elevator",108183.2265,173093.1649,151456.51699999999,242330.43090000001,194729.8076,311567.69679999998,259639.74350000001,415423.59570000001,324549.67930000002,519279.49469999998,367822.96990000003,588516.76060000004,411096.26049999997,657754.02650000004]
[1,"Region I - Northeast",null,"NEW HAMPSHIRE","NASHUA","Detached/Semi-Detached",132526.03630000001,231920.56340000001,172157.69200000001,301275.96090000001,205846.01759999999,360230.53080000001,245625.9019,429845.32829999999,289922.96029999998,507365.18040000001,318102.0613,556678.60730000003,344667.73680000001,603168.53949999996]
[1,"Region I - Northeast",null,"NEW HAMPSHIRE","NASHUA","Row House",110491.8296,193360.70189999999,147222.86410000001,257640.01209999999,181393.9608,317439.4314,228237.50690000001,399415.63699999999,276085.99709999998,483150.49479999999,304874.1127,533529.69720000005,331840.33490000002,580720.58609999996]
[1,"Region I - Northeast",null,"NEW HAMPSHIRE","NASHUA","Walkup",101561.2944,177732.26519999999,140193.59959999999,245338.79930000001,177692.48069999999,310961.84139999998,231800.47519999999,405650.83169999998,288687.4901,505203.10759999999,324760.03999999998,568330.06999999995,360263.38640000002,630460.92630000005]
[1,"Region I - Northeast",null,"NEW HAMPSHIRE","NASHUA","Elevator",114246.9774,182795.16649999999,159945.7683,255913.23310000001,205644.55919999999,329031.29969999997,274192.74560000002,438708.3995,342740.93209999998,548385.49950000003,388439.723,621503.56599999999,434138.51390000002,694621.63260000001]
[1,"Region I - Northeast",null,"NEW HAMPSHIRE","PORTSMOUTH","Detached/Semi-Detached",123149.79090000001,215512.1342,159941.23050000001,279897.15330000001,191207.40049999999,334612.951,228114.45319999999,399200.29320000001,269222.40580000001,471139.21010000003,295376.34759999998,516908.60830000002,320020.6532,560036.14320000005]
[1,"Region I - Northeast",null,"NEW HAMPSHIRE","PORTSMOUTH","Row House",102870.57090000001,180023.49909999999,136992.36309999999,239736.6355,168702.85339999999,295229.99349999998,212110.97519999999,371194.20649999997,256487.50200000001,448853.12849999999,283201.95289999997,495603.41759999999,308214.9032,539376.08050000004]
[1,"Region I - Northeast",null,"NEW HAMPSHIRE","PORTSMOUTH","Walkup",94681.951799999995,165693.41570000001,130721.19190000001,228762.0857,165717.2806,290005.24109999998,216241.55499999999,378422.72129999998,269323.51179999998,471316.14569999999,303006.87099999998,530262.02430000005,336166.3615,588291.13249999995]
[1,"Region I - Northeast",null,"NEW HAMPSHIRE","PORTSMOUTH","Elevator",106168.3817,169869.41329999999,148635.73439999999,237817.17860000001,191103.0871,305764.94380000001,254804.11610000001,407686.59179999999,318505.14510000002,509608.23979999998,360972.49780000001,577556.00509999995,403439.8505,645503.77040000004]
[1,"Region I - Northeast",null,"RHODE ISLAND","NEWPORT","Detached/Semi-Detached",133559.5528,233729.21739999999,173324.16740000001,303317.2929,207087.2965,362402.76890000002,246893.84460000001,432064.228,291268.89980000001,509720.5747,319514.88760000002,559151.05330000003,346084.5563,605647.97340000002]
[1,"Region I - Northeast",null,"RHODE ISLAND","NEWPORT","Row House",112305.55590000001,196534.72270000001,149271.98749999999,261225.97810000001,183500.7984,321126.39720000001,230120.96729999999,402711.69280000002,277921.7402,486363.0453,306755.18459999998,536821.57299999997,333711.22110000002,583994.63699999999]
[1,"Region I - Northeast",null,"RHODE ISLAND","NEWPORT","Walkup",103839.90089999999,181719.8265,143454.16940000001,251044.79639999999,181975.13510000001,318456.48639999999,237692.01990000001,415961.03499999997,296089.55290000001,518156.71759999997,333234.67700000003,583160.68469999998,369830.74619999999,647203.80590000004]
[1,"Region I - Northeast",null,"RHODE ISLAND","NEWPORT","Elevator",115159.32,184254.9148,161223.04800000001,257956.88070000001,207286.77600000001,331658.84659999999,276382.36800000002,442211.7954,345477.96010000003,552764.74430000002,391541.68810000003,626466.71030000004,437605.41600000003,700168.67610000004]
[1,"Region I - Northeast",null,"RHODE ISLAND","PROVIDENCE","Detached/Semi-Detached",138693.53279999999,242713.68239999999,180124.14980000001,315217.26209999999,215331.8014,376830.65250000003,256889.83530000001,449557.21169999999,303179.4167,530563.97919999994,332630.4938,582103.36399999994,360380.08510000003,630665.14890000003]
[1,"Region I - Northeast",null,"RHODE ISLAND","PROVIDENCE","Row House",115879.41650000001,202788.97889999999,154306.674,270036.67940000002,190014.18590000001,332524.82539999997,238885.92240000001,418050.36410000001,288852.64990000002,505492.13740000001,318934.29969999997,558135.02430000005,347098.61629999999,607422.5784]
[1,"Region I - Northeast",null,"RHODE ISLAND","PROVIDENCE","Walkup",106671.1182,186674.45689999999,147276.8322,257734.4564,186709.00099999999,326740.75180000003,243641.16320000001,426372.0356,303450.7181,531038.75659999996,341406.0662,597460.61569999997,378772.06180000002,662851.10829999996]
[1,"Region I - Northeast",null,"RHODE ISLAND","PROVIDENCE","Elevator",119569.3159,191310.90830000001,167397.0422,267835.27159999998,215224.76860000001,344359.6349,286966.35810000001,459146.17989999999,358707.94770000002,573932.72479999997,406535.674,650457.0882,454363.40039999998,726981.45149999997]
[1,"Region I - Northeast",null,"VERMONT","BRATTLEBORO","Detached/Semi-Detached",123024.80530000001,215293.4093,159674.47500000001,279430.33110000001,190797.4822,333895.59389999998,227498.932,398123.13099999999,268406.56819999998,469711.49430000002,294443.31790000002,515275.8064,318942.13030000002,558148.72809999995]
[1,"Region I - Northeast",null,"VERMONT","BRATTLEBORO","Row House",103330.705,180828.73379999999,137387.59349999999,240428.2887,168942.1041,295648.68229999999,211957.09220000001,370924.91149999999,256039.0171,448068.27980000002,282620.10739999998,494585.18780000001,307476.93040000001,538084.62820000004]
[1,"Region I - Northeast",null,"VERMONT","BRATTLEBORO","Walkup",95467.356499999994,167067.87409999999,131873.64910000001,230778.88579999999,167266.8811,292717.04190000001,218443.69330000001,382276.4632,272104.40860000002,476182.71509999997,306222.77830000001,535889.86199999996,339832.3909,594706.68389999995]
[1,"Region I - Northeast",null,"VERMONT","BRATTLEBORO","Elevator",106073.3066,169717.29319999999,148502.6293,237604.21049999999,190931.95189999999,305491.12770000001,254575.93599999999,407321.5036,318219.92,509151.87949999998,360649.2426,577038.79669999995,403078.56520000001,644925.71400000004]
[1,"Region I - Northeast",null,"VERMONT","BURLINGTON","Detached/Semi-Detached",124991.70729999999,218735.4878,162313.38380000001,284048.4216,194025.8075,339545.16310000001,231452.5981,405042.04670000001,273144.95309999998,478003.6678,299672.67489999998,524427.18090000004,324662.45569999999,568159.29740000004]
[1,"Region I - Northeast",null,"VERMONT","BURLINGTON","Row House",104517.5223,182905.66409999999,139143.85449999999,243501.74530000001,171304.8707,299783.52360000001,215295.24050000001,376766.67090000003,260287.59839999999,455503.29710000003,287381.21870000003,502917.13270000002,312743.1888,547300.58039999998]
[1,"Region I - Northeast",null,"VERMONT","BURLINGTON","Walkup",96267.259099999996,168467.7034,132922.99170000001,232615.23560000001,168525.54300000001,294919.70010000002,219940.57010000001,384895.9976,273937.8726,479391.27710000001,308215.07179999998,539376.37580000004,341963.3651,598435.88899999997]
[1,"Region I - Northeast",null,"VERMONT","BURLINGTON","Elevator",107758.7447,172413.99419999999,150862.2426,241379.59179999999,193965.74050000001,310345.18939999997,258620.98740000001,413793.5858,323276.23420000001,517241.98239999998,366379.73200000002,586207.57999999996,409483.23,655173.17760000005]
[1,"Region I - Northeast",null,"VERMONT","MONTPELIER","Detached/Semi-Detached",125550.13219999999,219712.73139999999,162985.54610000001,285224.70569999999,194783.09340000001,340870.41360000003,232291.75150000001,406510.56510000001,274089.87839999999,479657.28710000002,300690.10840000003,526207.68980000005,325730.38429999998,570028.17260000005]
[1,"Region I - Northeast",null,"VERMONT","MONTPELIER","Row House",105271.0122,184224.27129999999,140036.67869999999,245064.18780000001,172278.54629999999,301487.45610000001,216288.27340000001,378504.47840000002,261354.97459999999,457371.20549999998,288515.71370000002,504902.49900000001,313924.63419999997,549368.10990000004]
[1,"Region I - Northeast",null,"VERMONT","MONTPELIER","Walkup",97144.765599999999,170003.33979999999,134169.1312,234795.97949999999,170150.34539999999,297763.10440000001,222152.30809999999,388766.5392,276711.95319999999,484245.91800000001,311380.43780000001,544915.76619999995,345525.05379999999,604668.84420000005]
[1,"Region I - Northeast",null,"VERMONT","MONTPELIER","Elevator",108246.6119,173194.5816,151545.25659999999,242472.4143,194843.9014,311750.24680000002,259791.86850000001,415666.99579999998,324739.8357,519583.74479999999,368038.4804,588861.5773,411337.1251,658139.41]
[1,"Region I - Northeast",null,"VERMONT","RUTLAND","Detached/Semi-Detached",122508.0434,214389.07610000001,159091.23269999999,278409.65710000001,190176.83739999999,332809.4656,226864.95439999999,397013.6703,267733.59120000002,468533.78450000001,293736.89689999999,514039.56949999998,318233.7121,556908.99620000005]
[1,"Region I - Northeast",null,"VERMONT","RUTLAND","Row House",102423.8383,179241.71710000001,136363.02729999999,238635.2977,167888.68,293805.19,211015.35569999999,369276.8726,255121.13829999999,446461.99190000002,281679.56349999999,492939.23609999998,306541.47879999998,536447.58790000004]
[1,"Region I - Northeast",null,"VERMONT","RUTLAND","Walkup",94328.049700000003,165074.08689999999,130243.359,227925.87830000001,165125.54740000001,288969.70789999998,215497.91209999999,377121.34629999998,268403.36619999999,469705.89079999999,301985.4474,528474.53289999999,335048.69699999999,586335.21979999996]
[1,"Region I - Northeast",null,"VERMONT","RUTLAND","Elevator",105617.13219999999,168987.41409999999,147863.98509999999,236582.37969999999,190110.83799999999,304177.34529999999,253481.11730000001,405569.79379999998,316851.39669999998,506962.24219999998,359098.24959999998,574557.20779999997,401345.10239999997,642152.17350000003]
[10,"Region X - Northwest",null,"ALASKA","ANCHORAGE","Detached/Semi-Detached",139927.1128,244872.44750000001,181420.66159999999,317486.15779999999,216615.41250000001,379076.9718,258051.07810000001,451589.38669999997,304288.31900000002,532504.55830000003,333736.10389999999,584038.18180000002,361379.97690000001,632414.95959999994]
[10,"Region X - Northwest",null,"ALASKA","ANCHORAGE","Row House",118561.93,207483.37760000001,157242.39060000001,275174.18349999998,192905.26459999999,337584.21299999999,241190.27069999999,422082.97379999998,290871.18829999998,509024.57939999999,320909.50939999998,561591.64139999996,348941.77590000001,610648.10789999994]
[10,"Region X - Northwest",null,"ALASKA","ANCHORAGE","Walkup",110199.16099999999,192848.53159999999,152347.05919999999,266607.35359999997,193395.92310000001,338442.86540000001,252893.8321,442564.20610000001,315086.44209999999,551401.27370000002,354752.25160000002,620816.44039999996,393866.12800000003,689265.72409999999]
[10,"Region X - Northwest",null,"ALASKA","ANCHORAGE","Elevator",120669.88989999999,193071.82689999999,168937.84589999999,270300.5576,217205.80189999999,347529.28820000001,289607.73580000002,463372.38429999998,362009.66979999997,579215.48030000005,410277.62579999998,656444.21109999996,458545.58179999999,733672.94180000003]
[10,"Region X - Northwest",null,"ALASKA","FAIRBANKS","Detached/Semi-Detached",143519.28159999999,251158.74280000001,186043.55850000001,325576.22739999997,222105.02499999999,388683.79399999999,264548.89429999999,462960.5649,311920.75679999997,545861.32440000004,342094.58500000002,598665.52390000003,370408.34120000002,648214.59719999996]
[10,"Region X - Northwest",null,"ALASKA","FAIRBANKS","Row House",121792.0261,213136.04560000001,161455.48420000001,282547.09730000002,197993.00820000001,346487.76449999999,247402.30910000001,432954.04080000002,298276.21590000001,521983.37770000001,329050.58960000001,575838.5318,357759.3222,626078.8138]
[10,"Region X - Northwest",null,"ALASKA","FAIRBANKS","Walkup",113319.2292,198308.65109999999,156682.41279999999,274194.22240000003,198927.93419999999,348123.8848,260185.65340000001,455324.8933,324183.74660000001,567321.55649999995,365022.77189999999,638789.85089999996,405300.50929999998,709275.89119999995]
[10,"Region X - Northwest",null,"ALASKA","FAIRBANKS","Elevator",123771.8783,198035.00829999999,173280.62969999999,277249.01169999997,222789.38099999999,356463.01500000001,297052.50809999998,475284.02,371315.63510000001,594105.02509999997,420824.38640000002,673319.02839999995,470333.13770000002,752533.03170000005]
[10,"Region X - Northwest",null,"ALASKA","JUNEAU","Detached/Semi-Detached",144694.38709999999,253215.17739999999,187734.94039999999,328536.14569999999,224271.03570000001,392474.3125,267333.0833,467832.8958,315348.10129999998,551859.17720000003,345914.89919999999,605351.0736,374654.4166,655645.22900000005]
[10,"Region X - Northwest",null,"ALASKA","JUNEAU","Row House",121880.5199,213290.9099,161917.46359999999,283355.5613,198953.4192,348168.48359999998,249329.1697,436326.04700000002,301021.33399999997,526787.33440000005,332218.7046,581382.73300000001,361372.9472,632402.65749999997]
[10,"Region X - Northwest",null,"ALASKA","JUNEAU","Walkup",112828.15240000001,197449.26680000001,155896.68,272819.19,197791.6623,346135.40909999999,258418.0448,452231.5784,321921.82,563363.18500000006,362339.9816,634094.96770000004,402168.79070000001,703795.38379999995]
[10,"Region X - Northwest",null,"ALASKA","JUNEAU","Elevator",124764.89230000001,199623.83059999999,174670.84909999999,279473.3628,224576.80609999999,359322.89500000002,299435.7414,479097.19339999999,374294.67670000001,598871.49179999996,424200.6336,678721.02390000003,474106.5906,758570.55630000005]
[10,"Region X - Northwest",null,"ALASKA","KETCHIKAN","Detached/Semi-Detached",147690.6404,258458.62059999999,191568.5442,335244.95240000001,228803.68539999999,400406.44949999999,272670.63679999998,477173.61420000001,321598.05180000002,562796.59069999994,352751.01510000002,617314.27650000004,382023.45860000001,668541.05249999999]
[10,"Region X - Northwest",null,"ALASKA","KETCHIKAN","Row House",124695.7879,218217.62890000001,165546.16699999999,289705.79229999997,203285.13570000001,355748.98739999998,254523.8351,445416.71130000002,307157.58010000002,537525.76529999997,338946.12060000002,593155.71109999996,368636.5808,645114.01639999996]
[10,"Region X - Northwest",null,"ALASKA","KETCHIKAN","Walkup",115619.59329999999,202334.28829999999,159788.32639999999,279629.5711,202774.2003,354854.85060000001,265019.3322,463783.83140000002,330164.69329999998,577788.21329999994,371662.0257,650408.54500000004,412565.32829999999,721989.32460000005]
[10,"Region X - Northwest",null,"ALASKA","KETCHIKAN","Elevator",127355.0001,203768.00320000001,178297.0001,285275.20439999999,229239.0001,366782.4056,305652.0001,489043.20750000002,382065.0001,611304.00939999998,433007.0001,692811.21059999999,483949.0001,774318.41189999995]
[10,"Region X - Northwest",null,"IDAHO","BOISE","Detached/Semi-Detached",122678.87179999999,214688.02559999999,159418.70680000001,278982.73690000002,190660.37270000001,333655.65220000001,227569.73180000001,398247.0306,268655.77970000001,470147.61450000003,294787.038,515877.31640000001,319439.88209999999,559019.79370000004]
[10,"Region X - Northwest",null,"IDAHO","BOISE","Row House",101995.61719999999,178492.3302,136012.75390000001,238022.31940000001,167707.58979999999,293488.28210000001,211247.50339999999,369683.13089999999,255667.22769999999,447417.64850000001,282370.15889999998,494147.7781,307398.9902,537948.23289999994]
[10,"Region X - Northwest",null,"IDAHO","BOISE","Walkup",93567.927299999996,163743.87280000001,129125.03780000001,225968.8162,163618.22010000001,286331.88510000001,213348.9,373360.57490000001,265688.20500000002,464954.35879999999,298842.51130000001,522974.39480000001,331462.5147,580059.40060000005]
[10,"Region X - Northwest",null,"IDAHO","BOISE","Elevator",105751.58530000001,169202.53899999999,148052.2194,236883.5546,190352.8535,304564.57010000001,253803.80470000001,406086.09350000002,317254.75589999999,507607.61690000002,359555.39,575288.63249999995,401856.02409999998,642969.64820000005]
[10,"Region X - Northwest",null,"IDAHO","COEUR D'ALENE","Detached/Semi-Detached",125582.87450000001,219770.03030000001,163028.91329999999,285300.59820000001,194835.67310000001,340962.42800000001,232355.50140000001,406622.1274,274165.8382,479790.2169,300773.75380000001,526354.06920000003,325821.55469999998,570187.72069999995]
[10,"Region X - Northwest",null,"IDAHO","COEUR D'ALENE","Row House",105293.80469999999,184264.15820000001,140068.78769999999,245120.37839999999,172320.0857,301560.15010000003,216344.17230000001,378602.3015,261424.68700000001,457493.20209999999,288593.38660000003,505038.4265,314010.01289999997,549517.52260000003]
[10,"Region X - Northwest",null,"IDAHO","COEUR D'ALENE","Walkup",97162.821800000005,170034.9382,134193.51029999999,234838.64309999999,170180.53580000001,297815.93770000001,222190.24909999999,388832.93579999998,276758.89929999999,484328.07380000001,311432.55119999999,545006.96470000001,345582.07740000001,604768.63549999997]
[10,"Region X - Northwest",null,"IDAHO","COEUR D'ALENE","Elevator",108274.7368,173239.5815,151584.63149999999,242535.41409999999,194894.5263,311831.24660000001,259859.36840000001,415774.99550000002,324824.21049999999,519718.74449999997,368134.10519999999,589014.57700000005,411443.9999,658310.40969999996]
[10,"Region X - Northwest",null,"IDAHO","IDAHO FALLS","Detached/Semi-Detached",120278.53049999999,210487.4284,156374.39120000001,273655.18459999998,187084.67980000001,327398.18969999999,223392.43350000001,390936.75870000001,263788.30719999998,461629.53749999998,289473.27710000001,506578.23499999999,313730.15100000001,549027.76430000004]
[10,"Region X - Northwest",null,"IDAHO","IDAHO FALLS","Row House",99595.176000000007,174291.55790000001,132968.43830000001,232694.76699999999,164131.89689999999,287230.81959999999,207070.20509999999,362372.859,250799.75510000001,438899.57140000002,277056.39809999999,484848.69660000002,301689.25910000002,527956.20349999995]
[10,"Region X - Northwest",null,"IDAHO","IDAHO FALLS","Walkup",91105.113500000007,159433.94870000001,125677.09849999999,219934.92249999999,159185.15530000001,278574.02179999999,207438.14689999999,363016.75709999999,258299.76370000001,452024.58639999997,290468.94449999998,508320.65289999999,322103.8223,563681.68909999996]
[10,"Region X - Northwest",null,"IDAHO","IDAHO FALLS","Elevator",103673.3551,165877.3707,145142.69709999999,232228.31890000001,186612.0392,298579.2672,248816.05230000001,398105.68959999998,311020.06530000002,497632.11200000002,352489.40740000003,563983.06019999995,393958.74949999998,630334.00859999994]
[10,"Region X - Northwest",null,"IDAHO","LEWISTON","Detached/Semi-Detached",122989.69070000001,215231.95869999999,159594.22829999999,279289.8996,190671.35690000001,333674.87469999999,227306.5062,397786.38579999999,268149.81189999997,469262.17070000002,294149.03450000001,514760.81030000001,318600.85399999999,557551.49439999997]
[10,"Region X - Northwest",null,"IDAHO","LEWISTON","Row House",103488.6404,181105.12059999999,137525.75719999999,240670.07519999999,169030.16039999999,295802.78080000001,211916.97570000001,370854.70740000001,255903.46220000001,447831.0588,282441.69079999998,494272.95880000002,307248.01240000001,537684.02170000004]
[10,"Region X - Northwest",null,"IDAHO","LEWISTON","Walkup",95732.768200000006,167532.3443,132262.67559999999,231459.68220000001,167789.45050000001,293631.53830000001,219185.3247,383574.31819999998,273040.7598,477821.3297,307305.16590000002,537784.04040000006,341065.80070000002,596865.15119999996]
[10,"Region X - Northwest",null,"IDAHO","LEWISTON","Elevator",106047.2389,169675.58480000001,148466.13449999999,237545.81880000001,190885.0301,305416.0526,254513.37340000001,407221.40350000001,318141.71679999999,509026.75439999998,360560.61229999998,576896.98829999997,402979.50790000003,644767.22219999996]
[10,"Region X - Northwest",null,"IDAHO","POCATELLO","Detached/Semi-Detached",118837.30409999999,207965.28210000001,154364.2683,270137.46950000001,184561.0502,322981.83789999998,220214.15849999999,385374.77740000002,259918.87330000001,454858.0282,285177.69260000001,499060.9621,308986.56709999999,540726.49230000004]
[10,"Region X - Northwest",null,"IDAHO","POCATELLO","Row House",99139.048899999994,173493.33549999999,132072.8836,231127.54629999999,162701.25599999999,284727.19799999997,204669.1784,358171.06209999998,247548.82320000001,433210.44050000003,273352.0931,478366.16279999999,297519.05040000001,520658.3382]
[10,"Region X - Northwest",null,"IDAHO","POCATELLO","Walkup",91164.653999999995,159538.1446,125849.50569999999,220236.63500000001,159521.09220000001,279161.91139999998,208115.0496,364201.33689999999,259193.41209999999,453588.47100000002,291589.8786,510282.28759999998,323477.4852,566085.59909999999]
[10,"Region X - Northwest",null,"IDAHO","POCATELLO","Elevator",102447.65300000001,163916.24729999999,143426.71419999999,229482.7463,184405.77540000001,295049.2451,245874.36730000001,393398.99359999999,307342.95919999998,491748.74200000003,348322.02039999998,557315.24089999998,389301.08159999998,622881.73990000004]
[10,"Region X - Northwest",null,"IDAHO","TWIN FALLS","Detached/Semi-Detached",122078.7838,213637.87160000001,158657.62450000001,277650.84289999999,189766.4455,332091.27960000001,226525.4025,396419.45449999999,267438.90620000003,468018.0858,293458.59179999999,513552.5356,318012.44290000002,556521.77520000003]
[10,"Region X - Northwest",null,"IDAHO","TWIN FALLS","Row House",101395.5042,177442.1324,135251.6716,236690.4253,166813.66260000001,291923.90950000001,210203.17420000001,367855.55469999998,254450.3541,445288.11979999999,281041.71279999998,491822.99739999999,305971.55109999998,535450.21440000006]
[10,"Region X - Northwest",null,"IDAHO","TWIN FALLS","Walkup",92952.221099999995,162666.38690000001,128263.04919999999,224460.33609999999,162509.94889999999,284392.4106,211871.20509999999,370774.60889999999,263841.08639999997,461721.90120000002,296749.1102,519310.94290000002,329122.83110000001,575964.95440000005]
[10,"Region X - Northwest",null,"IDAHO","TWIN FALLS","Elevator",105232.0254,168371.2432,147324.83549999999,235719.74050000001,189417.64569999999,303068.2377,252556.86110000001,404090.98369999998,315696.07620000001,505113.72950000002,357788.88640000002,572462.22679999995,399881.69660000002,639810.72420000006]
[10,"Region X - Northwest",null,"OREGON","BEND","Detached/Semi-Detached",130342.459,228099.30319999999,169130.5845,295978.52289999998,202060.53320000001,353605.93310000002,240878.19390000001,421536.83929999999,284156.02559999999,497273.04479999997,311705.44069999998,545484.52119999996,337613.58240000001,590823.76930000004]
[10,"Region X - Northwest",null,"OREGON","BEND","Row House",109701.3173,191977.30540000001,145771.91519999999,255100.85149999999,179154.11840000001,313519.7071,224588.93890000001,393030.64299999998,271193.71240000002,474588.99660000001,299313.64559999999,523798.8799,325597.01490000001,569794.77619999996]
[10,"Region X - Northwest",null,"OREGON","BEND","Walkup",101496.2295,177618.40169999999,140228.4387,245399.7677,177898.86900000001,311323.02069999999,232399.47949999999,406699.08909999998,289503.44530000002,506631.0294,325837.70439999999,570215.98270000005,361638.73989999999,632867.79469999997]
[10,"Region X - Northwest",null,"OREGON","BEND","Elevator",112387.7044,179820.32980000001,157342.7862,251748.46170000001,202297.86799999999,323676.59350000002,269730.49060000002,431568.79139999999,337163.11320000002,539460.98919999995,382118.19500000001,611389.12120000005,427073.27679999999,683317.25309999997]
[10,"Region X - Northwest",null,"OREGON","EUGENE","Detached/Semi-Detached",128546.3817,224956.16800000001,166819.1453,291933.50429999997,199315.73800000001,348802.54139999999,237629.299,415851.2732,280339.8222,490594.68890000001,307526.21710000001,538170.87990000006,333099.41869999998,582923.98270000005]
[10,"Region X - Northwest",null,"OREGON","EUGENE","Row House",108086.27529999999,189150.98190000001,143665.37640000001,251414.4086,176610.25640000001,309067.94870000001,221482.932,387595.13099999999,267491.21340000001,468109.62349999999,295243.12190000003,516675.4633,321188.25959999999,562079.45420000004]
[10,"Region X - Northwest",null,"OREGON","EUGENE","Walkup",99936.201000000001,174888.3518,138060.7697,241606.34700000001,175132.87330000001,306482.5282,228753.58180000001,400318.76809999999,284954.80920000002,498670.91609999997,320702.46240000002,561229.30909999995,355921.56939999998,622862.74639999995]
[10,"Region X - Northwest",null,"OREGON","EUGENE","Elevator",110836.7164,177338.74890000001,155171.40289999999,248274.24840000001,199506.0894,319209.74780000001,266008.11920000002,425612.99719999998,332510.14909999998,532016.24639999995,376844.8357,602951.74600000004,421179.5221,673887.24549999996]
[10,"Region X - Northwest",null,"OREGON","KLAMATH FALLS","Detached/Semi-Detached",122578.93859999999,214513.14249999999,158982.71100000001,278219.74410000001,189872.27100000001,332276.4742,226258.64780000001,395952.6335,266846.30729999999,466981.03779999999,292690.5453,512208.45429999998,316970.11780000001,554697.70620000002]
[10,"Region X - Northwest",null,"OREGON","KLAMATH FALLS","Row House",103567.4667,181243.06659999999,137468.14780000001,240569.2586,168774.258,295354.95140000002,211255.38699999999,369696.92719999998,254907.33499999999,446087.83620000002,281277.0502,492234.83789999998,305902.22700000001,535328.89740000002]
[10,"Region X - Northwest",null,"OREGON","KLAMATH FALLS","Walkup",96075.804499999998,168132.65779999999,132787.18179999999,232377.56820000001,168520.60490000001,294911.05859999999,220273.997,385479.49469999998,274425.21620000002,480244.12839999999,308927.95529999997,540623.92180000001,342939.5674,600144.24300000002]
[10,"Region X - Northwest",null,"OREGON","KLAMATH FALLS","Elevator",105702.6005,169124.16329999999,147983.64069999999,236773.82870000001,190264.68090000001,304423.4939,253686.24119999999,405897.99200000003,317107.8015,507372.49,359388.84169999999,575022.15529999998,401669.88189999998,642671.82070000004]
[10,"Region X - Northwest",null,"OREGON","MEDFORD","Detached/Semi-Detached",124366.67080000001,217641.674,161350.57139999999,282363.4999,192743.13680000001,337300.48930000002,229739.40839999999,402043.96460000001,270993.73599999998,474239.0379,297257.60489999998,520200.80859999999,321948.04499999998,563409.07880000002]
[10,"Region X - Northwest",null,"OREGON","MEDFORD","Row House",104811.9409,183420.89660000001,139221.3046,243637.28289999999,171042.3216,299324.06280000001,214307.4817,375038.09299999999,258713.64910000001,452748.88589999999,285518.00890000002,499656.51569999999,310563.9278,543486.87379999994]
[10,"Region X - Northwest",null,"OREGON","MEDFORD","Walkup",97061.678799999994,169857.93780000001,134118.29300000001,234707.01259999999,170169.01120000001,297795.7696,222345.58180000001,389104.7683,276988.48930000002,484729.85619999998,311773.36109999998,545603.38190000004,346053.07370000001,605592.87899999996]
[10,"Region X - Northwest",null,"OREGON","MEDFORD","Elevator",107238.23020000001,171581.1709,150133.52230000001,240213.63920000001,193028.8143,308846.10749999998,257371.7524,411794.81,321714.69050000003,514743.51250000001,364609.98269999999,583375.98089999997,407505.27470000001,652008.44920000003]
[10,"Region X - Northwest",null,"OREGON","PENDLETON","Detached/Semi-Detached",127346.21279999999,222855.8725,165296.98980000001,289269.73210000002,197527.89420000001,345673.81479999999,235540.65299999999,412196.14270000003,277906.0895,486335.65669999999,304869.3407,533521.34609999997,330244.55739999999,577927.97549999994]
[10,"Region X - Northwest",null,"OREGON","PENDLETON","Row House",106886.05650000001,187050.59890000001,142143.22080000001,248750.63639999999,174822.41260000001,305939.22200000001,219394.28599999999,383940.00040000002,265057.48070000001,463850.59120000002,292586.24540000001,512025.92950000003,318333.3983,557083.44700000004]
[10,"Region X - Northwest",null,"OREGON","PENDLETON","Walkup",98704.795899999997,172733.39300000001,136336.8026,238589.40460000001,172916.34419999999,302603.60230000003,225798.20970000001,395146.86690000002,281260.59409999999,492206.03960000002,316515.68520000001,553902.44909999997,351242.23019999999,614673.90280000004]
[10,"Region X - Northwest",null,"OREGON","PENDLETON","Elevator",109797.60279999999,175676.16709999999,153716.6439,245946.63399999999,197635.6851,316217.10080000001,263514.24670000002,421622.80109999998,329392.80849999998,527028.50139999995,373311.84960000002,597298.9682,417230.89069999999,667569.4351]
[10,"Region X - Northwest",null,"OREGON","PORTLAND","Detached/Semi-Detached",129146.46610000001,226006.31580000001,167580.2231,293265.39039999997,200209.65979999999,350366.90470000001,238673.622,417678.83840000001,281556.68859999999,492724.20490000001,308854.65539999999,540495.64679999999,334526.8493,585421.98629999999]
[10,"Region X - Northwest",null,"OREGON","PORTLAND","Row House",108686.3848,190201.1734,144426.4541,252746.2948,177504.1783,310632.31199999998,222527.255,389422.69620000001,268708.0797,470239.13949999999,296571.5601,519000.23019999999,322615.69020000001,564577.45790000004]
[10,"Region X - Northwest",null,"OREGON","PORTLAND","Walkup",100551.90360000001,175965.83119999999,138922.75330000001,243114.81820000001,176241.1378,308421.99119999999,230231.26790000001,402904.71879999997,286801.91680000001,501903.35440000001,322795.85090000002,564892.73919999995,358261.239,626957.16819999996]
[10,"Region X - Northwest",null,"OREGON","PORTLAND","Elevator",111356.27310000001,178170.03969999999,155898.7824,249438.05549999999,200441.2916,320706.07130000001,267255.05550000002,427608.09519999998,334068.81939999998,534510.11899999995,378611.32860000001,605778.1348,423153.83789999998,677046.1507]
[10,"Region X - Northwest",null,"OREGON","SALEM","Detached/Semi-Detached",125562.6637,219734.66149999999,162900.93280000001,285076.6324,194594.01010000001,340539.51770000003,231943.98019999999,405901.96549999999,273593.07299999997,478787.87770000001,300108.39030000003,525189.68299999996,325034.7782,568810.86170000001]
[10,"Region X - Northwest",null,"OREGON","SALEM","Row House",105826.8735,185197.02859999999,140566.76560000001,245991.83979999999,172692.2617,302211.45799999998,216369.16560000001,378646.03970000002,261199.28169999999,457098.74300000002,288260.09450000001,504455.1654,313545.25260000001,548704.19200000004]
[10,"Region X - Northwest",null,"OREGON","SALEM","Walkup",98006.004700000005,171510.50829999999,135423.97839999999,236991.96230000001,171826.74230000001,300696.7991,224513.7934,392899.13860000001,279690.01789999998,489457.53110000002,314815.2145,550926.62540000002,349430.57459999999,611503.50549999997]
[10,"Region X - Northwest",null,"OREGON","SALEM","Elevator",108269.6614,173231.46100000001,151577.52609999999,242524.0454,194885.39060000001,311816.62969999999,259847.1876,415755.5062,324808.98440000002,519694.38290000003,368116.84909999999,588986.96719999996,411424.71360000002,658279.55160000001]
[10,"Region X - Northwest",null,"WASHINGTON","EVERETT","Detached/Semi-Detached",140506.3242,245886.0673,182322.77830000001,319064.86190000002,217824.49369999999,381192.864,259675.04449999999,454431.32789999997,306333.22379999998,536083.14159999997,336034.10489999998,588059.68350000004,363966.78659999999,636941.87650000001]
[10,"Region X - Northwest",null,"WASHINGTON","EVERETT","Row House",118235.61289999999,206912.32260000001,157120.00279999999,274960.0048,193109.677,337941.93479999999,242099.79509999999,423674.64150000003,292347.56969999999,511608.24690000003,322664.0098,564662.01710000006,351001.54239999998,614252.69909999997]
[10,"Region X - Northwest",null,"WASHINGTON","EVERETT","Walkup",109379.47199999999,191414.076,151117.64000000001,264455.8701,191710.20439999999,335492.85769999999,250435.72390000001,438262.51679999998,311970.12680000003,545947.7219,351121.03269999998,614461.80720000004,389696.61849999998,681969.08239999996]
[10,"Region X - Northwest",null,"WASHINGTON","EVERETT","Elevator",121151.0416,193841.66949999999,169611.45819999999,271378.33720000001,218071.87479999999,348915.0049,290762.4999,465220.00670000003,363453.12479999999,581525.00840000005,411913.54149999999,659061.67610000004,460373.95809999999,736598.34400000004]
[10,"Region X - Northwest",null,"WASHINGTON","OLYMPIA","Detached/Semi-Detached",135705.64170000001,237484.87289999999,176234.147,308409.7573,210673.1079,368677.9387,251320.44810000001,439810.78409999999,296598.27860000002,519046.98749999999,325406.58319999999,569461.52060000005,352547.32449999999,616957.81779999996]
[10,"Region X - Northwest",null,"WASHINGTON","OLYMPIA","Row House",113434.7303,198510.7781,151031.37150000001,264304.90010000003,185958.29120000001,325427.00959999999,233745.19870000001,409054.09769999998,282612.62449999998,494572.09279999998,312036.48810000002,546063.85419999994,339582.08020000003,594268.64040000003]
[10,"Region X - Northwest",null,"WASHINGTON","OLYMPIA","Walkup",104453.84450000001,182794.22779999999,144221.76139999999,252388.08249999999,182844.07490000001,319977.13099999999,238614.21780000001,417574.8811,297193.24410000001,520088.17729999998,334373.89909999998,585154.32330000005,370979.23379999999,649213.65910000005]
[10,"Region X - Northwest",null,"WASHINGTON","OLYMPIA","Elevator",116994.58130000001,187191.33290000001,163792.41380000001,262067.86600000001,210590.24619999999,336944.39899999998,280786.9951,449259.19870000001,350983.7438,561573.99840000004,397781.57630000002,636450.53150000004,444579.40879999998,711327.06469999999]
[10,"Region X - Northwest",null,"WASHINGTON","SEATTLE","Detached/Semi-Detached",138710.247,242742.93229999999,180011.33910000001,315019.84330000001,215079.69839999999,376389.47220000002,256426.1496,448745.76179999998,302517.02039999998,529404.78559999994,331854.8812,580746.04220000003,359452.62280000001,629042.09]
[10,"Region X - Northwest",null,"WASHINGTON","SEATTLE","Row House",116620.57090000001,204085.99909999999,155013.46400000001,271273.56180000002,190565.815,333490.17629999999,238993.78829999999,418239.12949999998,288645.07069999998,505128.87359999999,318593.48609999998,557538.60060000001,346592.78690000001,606537.37730000005]
[10,"Region X - Northwest",null,"WASHINGTON","SEATTLE","Walkup",107819.44349999999,188684.02609999999,148949.97099999999,260662.44930000001,188944.20869999999,330652.3653,246789.82620000001,431882.19579999999,307421.49070000002,537987.60869999998,345985.79070000001,605475.13379999995,383979.44799999997,671964.03399999999]
[10,"Region X - Northwest",null,"WASHINGTON","SEATTLE","Elevator",119600.05349999999,191360.08850000001,167440.07500000001,267904.12390000001,215280.09640000001,344448.1593,287040.12849999999,459264.21240000002,358800.1606,574080.26560000004,406640.18209999998,650624.30090000003,454480.2034,727168.33629999997]
[10,"Region X - Northwest",null,"WASHINGTON","SPOKANE","Detached/Semi-Detached",121962.15360000001,213433.76869999999,158334.46170000001,277085.30790000001,189230.47339999999,331153.3285,225678.03599999999,394936.56300000002,266291.8677,466010.76850000001,292137.75300000003,511241.06770000001,316470.18579999998,553822.82519999996]
[10,"Region X - Northwest",null,"WASHINGTON","SPOKANE","Row House",102226.21339999999,178895.87340000001,136000.29440000001,238000.51519999999,167328.72500000001,292825.26870000002,210103.2213,367680.6373,253898.07639999999,444321.63380000001,280289.4572,490506.55009999999,304980.66029999999,533716.15540000005]
[10,"Region X - Northwest",null,"WASHINGTON","SPOKANE","Walkup",94311.785900000003,165045.62530000001,130252.0721,227941.12609999999,165177.14850000001,289060.0098,215647.66829999999,377383.41950000002,268607.36139999999,470062.8824,302254.87050000002,528946.02339999995,335392.54300000001,586936.95030000003]
[10,"Region X - Northwest",null,"WASHINGTON","SPOKANE","Elevator",105152.3178,168243.71100000001,147213.24489999999,235541.19529999999,189274.17189999999,302838.67969999998,252365.56270000001,403784.90620000003,315456.9534,504731.13280000002,357517.88040000002,572028.61719999998,399578.8076,639326.10160000005]
[10,"Region X - Northwest",null,"WASHINGTON","TACOMA","Detached/Semi-Detached",136909.99369999999,239592.489,177728.10569999999,311024.185,212397.9327,371696.3823,253293.18059999999,443263.0661,298866.42139999999,523016.23739999998,327869.56650000002,573771.7415,355170.3309,621548.07909999997]
[10,"Region X - Northwest",null,"WASHINGTON","TACOMA","Row House",114820.2427,200935.4247,152730.23069999999,267277.90350000001,187884.04930000001,328797.08630000002,235860.8193,412756.4338,284994.47169999999,498740.32530000003,314608.17139999999,550564.29989999998,342310.4951,599043.36640000006]
[10,"Region X - Northwest",null,"WASHINGTON","TACOMA","Walkup",105972.33590000001,185451.58790000001,146364.02050000001,256137.03580000001,185619.41510000001,324833.97639999999,242356.76800000001,424124.34399999998,301880.1679,528290.29390000005,339705.625,594484.84380000003,376960.43920000002,659680.76859999995]
[10,"Region X - Northwest",null,"WASHINGTON","TACOMA","Elevator",118041.3832,188866.21599999999,165257.93650000001,264412.7023,212474.48989999999,339959.1887,283299.3198,453278.91840000002,354124.14970000001,566598.64800000004,401340.70299999998,642145.13430000003,448557.25630000001,717691.62080000003]
[10,"Region X - Northwest",null,"WASHINGTON","VANCOUVER","Detached/Semi-Detached",128554.7337,224970.78409999999,166762.7335,291834.78360000002,199189.67879999999,348581.93780000001,237397.44709999999,415445.53240000003,280008.61349999998,490015.0735,307138.39929999999,537492.19869999995,332635.67499999999,582112.43130000005]
[10,"Region X - Northwest",null,"WASHINGTON","VANCOUVER","Row House",108456.84789999999,189799.484,144018.7654,252032.8394,176886.0638,309550.6116,221536.85630000001,387689.49849999999,267387.41340000002,467927.97340000002,295072.70370000001,516377.2316,320935.33260000002,561636.83219999995]
[10,"Region X - Northwest",null,"WASHINGTON","VANCOUVER","Walkup",100510.35920000001,175893.1286,138897.33290000001,243070.33259999999,176250.46919999999,308438.3211,230327.90280000001,403073.82990000001,286940.1825,502145.31929999997,322992.30989999999,565236.54229999997,358525.24599999998,627419.18039999995]
[10,"Region X - Northwest",null,"WASHINGTON","VANCOUVER","Elevator",110852.0808,177363.33199999999,155192.91320000001,248308.6648,199533.74549999999,319253.9975,266044.99400000001,425671.99680000002,332556.24249999999,532089.99600000004,376897.0748,603035.32869999995,421237.90720000002,673980.66150000005]
[10,"Region X - Northwest",null,"WASHINGTON","WENATCHEE","Detached/Semi-Detached",124958.4032,218677.20559999999,162168.06099999999,283794.1067,193763.11780000001,339085.45620000002,231015.58319999999,404277.27059999999,272541.81109999999,476948.16930000001,298973.86099999998,523204.25670000003,323839.2193,566718.63379999995]
[10,"Region X - Northwest",null,"WASHINGTON","WENATCHEE","Row House",105041.4777,183822.58609999999,139628.9933,244350.73819999999,171660.43609999999,300405.76319999999,215297.88039999999,376771.29070000001,260034.31539999999,455060.05190000002,287016.8653,502279.51429999998,312244.28539999999,546427.49950000003]
[10,"Region X - Northwest",null,"WASHINGTON","WENATCHEE","Walkup",97103.223100000003,169930.64050000001,134143.7133,234751.49830000001,170159.67980000001,297779.43979999999,222248.94699999999,388935.65710000001,276850.22360000003,484487.89130000002,311576.90210000001,545259.57869999995,345789.06660000002,605130.86659999995]
[10,"Region X - Northwest",null,"WASHINGTON","WENATCHEE","Elevator",107742.4225,172387.87849999999,150839.39139999999,241343.02989999999,193936.36040000001,310298.1814,258581.81390000001,413730.90840000001,323227.26740000001,517163.63559999998,366324.23639999999,586118.78689999995,409421.20539999998,655073.93839999998]
[10,"Region X - Northwest",null,"WASHINGTON","YAKIMA","Detached/Semi-Detached",127350.38890000001,222863.18049999999,165268.78390000001,289220.37170000002,197464.8645,345563.51299999998,235424.72700000001,411993.27230000001,277740.4852,486045.84899999999,304675.43170000002,533182.00549999997,330012.68550000002,577522.1997]
[10,"Region X - Northwest",null,"WASHINGTON","YAKIMA","Row House",107071.3429,187374.85,142319.91529999999,249059.85190000001,174960.31630000001,306180.55349999998,219421.2481,383987.18420000002,265005.5808,463759.76630000002,292501.03639999998,511876.81359999999,318206.93489999999,556862.13600000006]
[10,"Region X - Northwest",null,"WASHINGTON","YAKIMA","Walkup",98991.875100000005,173235.78140000001,136755.08429999999,239321.39739999999,173475.1421,303581.4987,226585.3702,396524.39779999998,282253.2807,493943.24119999999,317660.609,555906.06570000004,352544.06849999999,616952.11979999999]
[10,"Region X - Northwest",null,"WASHINGTON","YAKIMA","Elevator",109805.28509999999,175688.45869999999,153727.39910000001,245963.84220000001,197649.51310000001,316239.22560000001,263532.68410000001,421652.30089999997,329415.85519999999,527065.37620000006,373337.96919999999,597340.75959999999,417260.08319999999,667616.14320000005]
[2,"Region II - Northeast",null,"GUAM","GUAM","Detached/Semi-Detached",140310.34,245543.09510000001,182535.51560000001,319437.15240000002,218486.06969999999,382350.62209999998,261030.25450000001,456802.94530000002,308332.64990000002,539582.1372,338397.51500000001,592195.65119999996,366830.0724,641952.62679999997]
[2,"Region II - Northeast",null,"GUAM","GUAM","Row House",115545.8723,202205.27650000001,154511.41740000001,270394.9804,191004.55480000001,334257.97100000002,241487.54509999999,422603.20409999997,292781.37280000001,512367.40230000002,323530.70569999999,566178.73490000004,352413.435,616723.51119999995]
[2,"Region II - Northeast",null,"GUAM","GUAM","Walkup",105284.524,184247.91690000001,145159.29810000001,254028.77179999999,183760.2242,321580.39230000001,239256.11259999999,418698.1972,297875.3248,521281.81849999999,334873.20600000001,586028.11060000001,371231.36290000001,649654.88509999996]
[2,"Region II - Northeast",null,"GUAM","GUAM","Elevator",120925.36320000001,193480.584,169295.50839999999,270872.8175,217665.6537,348265.05109999998,290220.87160000001,464353.40149999998,362776.0895,580441.75190000003,411146.23479999998,657833.98540000001,459516.38,735226.21900000004]
[2,"Region II - Northeast",null,"NEW JERSEY","ATLANTIC CITY","Detached/Semi-Detached",152828.80119999999,267450.402,198340.32689999999,347095.5723,236985.1684,414724.04479999997,282550.7108,494463.7438,333342.9754,583350.20700000005,365672.72440000001,639927.26769999997,396087.12880000001,693152.47549999994]
[2,"Region II - Northeast",null,"NEW JERSEY","ATLANTIC CITY","Row House",128454.9382,224796.14189999999,170757.5527,298825.71720000001,209936.43290000001,367388.75750000001,263315.76030000002,460802.58059999999,318036.60009999998,556564.05020000006,351040.0379,614320.06629999995,381897.52480000001,668320.66850000003]
[2,"Region II - Northeast",null,"NEW JERSEY","ATLANTIC CITY","Walkup",118737.89230000001,207791.31169999999,164029.27429999999,287051.23009999999,208066.86869999999,364117.02010000002,271755.64150000003,475572.3726,338518.55190000002,592407.46569999994,380978.34620000003,666712.10589999997,422808.49050000001,739914.85849999997]
[2,"Region II - Northeast",null,"NEW JERSEY","ATLANTIC CITY","Elevator",131772.68229999999,210836.2948,184481.75520000001,295170.81270000001,237190.82810000001,379505.33059999999,316254.4374,506007.10739999998,395318.04680000001,632508.88430000003,448027.11969999998,716843.40209999995,500736.19260000001,801177.92009999999]
[2,"Region II - Northeast",null,"NEW JERSEY","CAMDEN","Detached/Semi-Detached",144010.9736,252019.20389999999,186796.01869999999,326893.03279999999,223103.82680000001,390431.69679999998,265878.4031,465287.20539999998,313587.33179999999,548777.83050000004,343964.42859999998,601937.74990000005,372507.95689999999,651888.92460000003]
[2,"Region II - Northeast",null,"NEW JERSEY","CAMDEN","Row House",121587.16220000001,212777.53390000001,161419.86689999999,282484.7671,198218.99059999999,346883.23349999997,248182.24909999999,434318.93589999998,299505.46679999999,524134.56670000002,330502.35729999997,578379.12509999995,359453.52149999997,629043.66260000004]
[2,"Region II - Northeast",null,"NEW JERSEY","CAMDEN","Walkup",112736.0491,197288.08590000001,155802.9957,272655.24249999999,197716.4578,346003.80109999998,258408.4417,452214.77299999999,321928.63219999999,563375.10629999998,362390.5183,634183.40689999994,402273.12640000001,703977.97120000003]
[2,"Region II - Northeast",null,"NEW JERSEY","CAMDEN","Elevator",124181.94749999999,198691.11919999999,173854.72659999999,278167.56670000002,223527.5056,357644.01429999998,298036.6741,476858.68579999998,372545.84269999998,596073.35719999997,422218.62180000002,675549.80480000004,471891.4008,755026.25249999994]
[2,"Region II - Northeast",null,"NEW JERSEY","ELIZABETH","Detached/Semi-Detached",149103.29819999999,260930.77189999999,193507.0912,338637.40960000001,231211.70269999999,404620.47970000003,275669.2328,482421.15730000002,325225.91800000001,569145.35660000006,356769.0417,624345.82279999997,386443.99660000001,676276.99410000001]
[2,"Region II - Northeast",null,"NEW JERSEY","ELIZABETH","Row House",125314.4051,219300.20879999999,166586.30290000001,291526.03000000003,204812.13630000001,358421.23839999997,256895.92079999999,449567.86139999999,310286.89539999998,543002.06700000004,342487.5392,599353.19369999995,372594.94270000001,652041.14989999996]
[2,"Region II - Northeast",null,"NEW JERSEY","ELIZABETH","Walkup",115829.07090000001,202700.87419999999,160009.8149,280017.17609999998,202966.8621,355192.0086,265091.63699999999,463910.36469999998,330216.77010000002,577879.34790000005,371633.88459999999,650359.29799999995,412436.46049999999,721763.80590000004]
[2,"Region II - Northeast",null,"NEW JERSEY","ELIZABETH","Elevator",128560.2573,205696.4148,179984.3602,287974.98070000001,231408.46309999999,370253.5466,308544.6176,493671.39539999998,385680.772,617089.24430000002,437104.8749,699367.81019999995,488528.97779999999,781646.37609999999]
[2,"Region II - Northeast",null,"NEW JERSEY","HACKENSACK","Detached/Semi-Detached",146744.62359999999,256803.0913,190551.70009999999,333465.47529999999,227772.65640000001,398602.14860000001,271697.1165,475469.95400000003,320630.40100000001,561103.20169999998,351766.30129999999,615591.02709999995,381093.78450000001,666914.12300000002]
[2,"Region II - Northeast",null,"NEW JERSEY","HACKENSACK","Row House",122760.59050000001,214831.03330000001,163410.24979999999,285967.93719999999,201156.70019999999,352024.2254,252769.92509999999,442347.3689,305568.92749999999,534745.62309999997,337367.73749999999,590393.54059999995,367131.21399999998,642479.62450000003]
[2,"Region II - Northeast",null,"NEW JERSEY","HACKENSACK","Walkup",113104.4605,197932.80590000001,156177.73009999999,273311.02759999997,198017.2726,346530.22700000001,258446.84959999999,452281.98670000001,321901.37790000002,563327.41139999998,362188.3652,633829.63919999998,401855.777,703247.60970000003]
[2,"Region II - Northeast",null,"NEW JERSEY","HACKENSACK","Elevator",126513.72289999999,202421.95980000001,177119.2121,283390.74369999999,227724.70129999999,364359.52750000003,303632.9351,485812.7034,379541.16889999999,607265.87919999997,430146.6581,688234.66310000001,480752.14720000001,769203.44700000004]
[2,"Region II - Northeast",null,"NEW JERSEY","JERSEY CITY","Detached/Semi-Detached",146744.62359999999,256803.0913,190551.70009999999,333465.47529999999,227772.65640000001,398602.14860000001,271697.1165,475469.95400000003,320630.40100000001,561103.20169999998,351766.30129999999,615591.02709999995,381093.78450000001,666914.12300000002]
[2,"Region II - Northeast",null,"NEW JERSEY","JERSEY CITY","Row House",122760.59050000001,214831.03330000001,163410.24979999999,285967.93719999999,201156.70019999999,352024.2254,252769.92509999999,442347.3689,305568.92749999999,534745.62309999997,337367.73749999999,590393.54059999995,367131.21399999998,642479.62450000003]
[2,"Region II - Northeast",null,"NEW JERSEY","JERSEY CITY","Walkup",113104.4605,197932.80590000001,156177.73009999999,273311.02759999997,198017.2726,346530.22700000001,258446.84959999999,452281.98670000001,321901.37790000002,563327.41139999998,362188.3652,633829.63919999998,401855.777,703247.60970000003]
[2,"Region II - Northeast",null,"NEW JERSEY","JERSEY CITY","Elevator",126513.72289999999,202421.95980000001,177119.2121,283390.74369999999,227724.70129999999,364359.52750000003,303632.9351,485812.7034,379541.16889999999,607265.87919999997,430146.6581,688234.66310000001,480752.14720000001,769203.44700000004]
[2,"Region II - Northeast",null,"NEW JERSEY","NEW BRUNSWICK","Detached/Semi-Detached",150303.4742,263031.07990000001,195029.25580000001,341301.19770000002,232999.55720000001,407749.22509999998,277757.89120000001,486076.30959999998,327659.66529999999,573404.41410000005,359425.9339,628995.38439999998,389298.8749,681273.03110000002]
[2,"Region II - Northeast",null,"NEW JERSEY","NEW BRUNSWICK","Row House",126514.63099999999,221400.60430000001,168108.4675,294189.81809999997,206599.99059999999,361549.98369999998,258984.57930000001,453223.01360000001,312720.64260000002,547261.12450000003,345144.43150000001,604002.75520000001,375449.8211,657037.18689999997]
[2,"Region II - Northeast",null,"NEW JERSEY","NEW BRUNSWICK","Walkup",117060.48330000001,204855.84589999999,161733.7922,283034.13640000002,205183.4044,359070.95760000002,268047.02679999999,469082.29670000001,333911.0074,584344.26289999997,375820.68660000002,657686.20169999998,417115.82760000002,729952.69830000005]
[2,"Region II - Northeast",null,"NEW JERSEY","NEW BRUNSWICK","Elevator",129599.37699999999,207359.00640000001,181439.12779999999,290302.60889999999,233278.8786,373246.21149999998,311038.5049,497661.6152,388798.1311,622077.01910000003,440637.88189999998,705020.62159999995,492477.63270000002,787964.22420000006]
[2,"Region II - Northeast",null,"NEW JERSEY","NEWARK","Detached/Semi-Detached",149828.37179999999,262199.6508,194534.92910000001,340436.12589999998,232515.54829999999,406902.2095,277329.0833,485325.89569999999,327258.62920000002,572702.60109999997,359030.51740000001,628303.40549999999,388949.95870000002,680662.4277]
[2,"Region II - Northeast",null,"NEW JERSEY","NEWARK","Row House",125454.3839,219545.17189999999,166952.15479999999,292166.2708,205466.81280000001,359566.92229999998,258094.13279999999,451664.73259999999,311952.25390000001,545916.44429999997,344397.8309,602696.20409999997,374760.35460000002,655830.62069999997]
[2,"Region II - Northeast",null,"NEW JERSEY","NEWARK","Walkup",115659.37239999999,202403.90169999999,159719.34640000001,279508.85619999998,202525.53279999999,354419.68229999999,264367.1936,462642.58870000002,329282.99190000002,576245.23589999997,370511.37829999998,648394.91209999996,411110.11469999998,719442.70070000004]
[2,"Region II - Northeast",null,"NEW JERSEY","NEWARK","Elevator",129174.89230000001,206679.83069999999,180844.84909999999,289351.76299999998,232514.80600000001,372023.69510000001,310019.74129999999,496031.59350000002,387524.67660000001,620039.49199999997,439194.6336,702711.42409999995,490864.59049999999,785383.35640000005]
[2,"Region II - Northeast",null,"NEW JERSEY","PATERSON","Detached/Semi-Detached",146702.96049999999,256730.18100000001,190462.78020000001,333309.8652,227636.01509999999,398363.02649999998,271491.94079999998,475110.89630000002,320358.45270000002,560627.29229999997,351455.28869999998,615046.75529999996,380734.27409999998,666284.97959999996]
[2,"Region II - Northeast",null,"NEW JERSEY","PATERSON","Row House",122913.9673,215099.44279999999,163541.99179999999,286198.48560000001,201236.44870000001,352163.78519999998,252718.62880000001,442257.60029999999,305419.4301,534484.00260000001,337173.78629999998,590054.12600000005,366885.22019999998,642049.13540000003]
[2,"Region II - Northeast",null,"NEW JERSEY","PATERSON","Walkup",113366.26089999999,198390.9566,156561.88080000001,273983.29139999999,198533.8039,347434.1568,259180.8927,453566.56229999999,322828.33980000002,564949.59479999996,363260.33020000003,635705.57790000003,403077.78210000001,705386.11880000005]
[2,"Region II - Northeast",null,"NEW JERSEY","PATERSON","Elevator",126482.03019999999,202371.25150000001,177074.84229999999,283319.75199999998,227667.6544,364268.2525,303556.8726,485691.00329999998,379446.0907,607113.75419999997,430038.90279999998,688062.25470000005,480631.71480000002,769010.75529999996]
[2,"Region II - Northeast",null,"NEW JERSEY","TRENTON","Detached/Semi-Detached",146577.9713,256511.4498,190196.02,332843.03509999998,227226.09150000001,397645.66009999998,270876.41330000001,474033.72320000001,319542.6079,559199.5638,350522.2512,613413.93940000003,379655.7426,664397.54960000003]
[2,"Region II - Northeast",null,"NEW JERSEY","TRENTON","Row House",123374.09789999999,215904.67129999999,163937.21770000001,286890.13089999999,201475.69399999999,352582.4645,252564.73970000001,441988.29430000001,304970.93790000002,533699.14130000002,336591.93290000001,589035.88249999995,366147.239,640757.66819999996]
[2,"Region II - Northeast",null,"NEW JERSEY","TRENTON","Walkup",114151.66190000001,199765.40839999999,157714.3328,276000.08240000001,200083.39780000001,350145.9461,261383.02220000001,457420.28889999999,325609.22570000001,569816.14489999996,366476.22499999998,641333.39379999996,406743.79759999999,711801.64569999999]
[2,"Region II - Northeast",null,"NEW JERSEY","TRENTON","Elevator",126386.95209999999,202219.12640000001,176941.7329,283106.7769,227496.51379999999,363994.42739999999,303328.685,485325.9032,379160.85629999998,606657.37899999996,429715.63709999999,687545.02949999995,480270.4179,768432.68019999994]
[2,"Region II - Northeast",null,"NEW JERSEY","VINELAND","Detached/Semi-Detached",142169.05729999999,248795.85029999999,184423.86540000001,322741.76449999999,220285.41990000001,385499.48469999997,262540.25819999998,459445.45189999999,309664.7844,541913.37269999995,339668.10139999999,594419.17729999998,367866.1545,643765.77040000004]
[2,"Region II - Northeast",null,"NEW JERSEY","VINELAND","Row House",119940.2107,209895.3688,159268.37549999999,278719.65720000002,195616.97330000001,342329.70329999999,244997.98370000001,428746.47149999999,295705.37030000001,517484.39809999999,326323.09139999998,571065.40989999997,354925.23580000002,621119.16269999999]
[2,"Region II - Northeast",null,"NEW JERSEY","VINELAND","Walkup",111150.74189999999,194513.79819999999,153601.19579999999,268802.09259999997,194908.1954,341089.3419,254709.42670000001,445741.49670000002,317314.27140000003,555299.97479999997,357182.3174,625069.05550000002,396476.12270000001,693833.21479999996]
[2,"Region II - Northeast",null,"NEW JERSEY","VINELAND","Elevator",122591.5845,196146.53829999999,171628.21840000001,274605.15350000001,220664.85219999999,353063.76870000002,294219.80290000001,470751.69170000002,367774.7537,588439.61459999997,416811.38750000001,666898.22990000003,465848.02130000002,745356.84519999998]
[2,"Region II - Northeast",null,"NEW YORK","ALBANY","Detached/Semi-Detached",133001.13140000001,232751.98009999999,172652.00959999999,302141.01689999999,206330.01579999999,361077.52769999998,246054.6974,430595.7205,290323.98180000001,508066.9681,318497.46189999999,557370.55830000003,345016.6361,603779.11309999996]
[2,"Region II - Northeast",null,"NEW YORK","ALBANY","Row House",111552.0696,195216.12179999999,148379.16769999999,259663.5436,182527.1281,319422.47409999999,229127.94070000001,400973.89620000002,276854.3713,484495.1496,305620.69750000001,534836.2206,332529.7843,581927.12250000006]
[2,"Region II - Northeast",null,"NEW YORK","ALBANY","Walkup",102962.398,180184.19649999999,142208.03520000001,248864.06159999999,180350.33919999999,315613.09360000002,235480.29070000001,412090.50880000001,293315.48340000003,513302.09600000002,330069.32339999999,577621.31599999999,366269.07140000002,640970.87509999995]
[2,"Region II - Northeast",null,"NEW YORK","ALBANY","Elevator",114671.45600000001,183474.33230000001,160540.03829999999,256864.06520000001,206408.6208,330253.79800000001,275211.49430000002,440338.39750000002,344014.36790000001,550422.99679999996,389882.95030000003,623812.72970000003,435751.53269999998,697202.46270000003]
[2,"Region II - Northeast",null,"NEW YORK","BINGHAMTON","Detached/Semi-Detached",124183.31110000001,217320.79440000001,161107.71049999999,281938.49329999997,192448.68479999999,336785.19839999999,229382.40220000001,401419.20380000002,270568.35259999998,473494.61700000003,296789.18190000003,519381.06829999998,321437.48119999998,562515.59199999995]
[2,"Region II - Northeast",null,"NEW YORK","BINGHAMTON","Row House",104684.30070000001,183197.52619999999,139041.49100000001,243322.60930000001,170809.69639999999,298916.96860000002,213994.44190000001,374490.2733,258323.25229999999,452065.69160000002,285083.03269999998,498895.30719999998,310085.79790000001,542650.14639999997]
[2,"Region II - Northeast",null,"NEW YORK","BINGHAMTON","Walkup",96960.562000000005,169680.9835,133981.76680000001,234468.0919,169999.94149999999,297499.89760000003,222133.10860000001,388732.94,276725.5858,484269.77500000002,311481.52049999998,545092.66079999995,345733.7352,605034.03650000005]
[2,"Region II - Northeast",null,"NEW YORK","BINGHAMTON","Elevator",107080.72749999999,171329.16649999999,149913.01850000001,239860.83309999999,192745.3095,308392.49969999999,256993.74590000001,411189.99959999998,321242.18239999999,513987.49949999998,364074.47340000002,582519.16610000003,406906.76439999999,651050.83270000003]
[2,"Region II - Northeast",null,"NEW YORK","BRONX","Detached/Semi-Detached",165372.11730000001,289401.20539999998,214717.85279999999,375756.24249999999,256639.95449999999,449119.9204,306104.47149999999,535682.82499999995,361215.64740000002,632127.38289999997,396284.6715,693498.17500000005,429309.39909999998,751291.44839999999]
[2,"Region II - Northeast",null,"NEW YORK","BRONX","Row House",138463.23310000001,242310.65789999999,184266.47020000001,322466.32280000002,226778.15059999999,396861.7635,284869.08630000002,498520.90100000001,344317.40919999999,602555.46600000001,380130.18550000002,665227.82479999994,413644.07620000001,723877.1335]
[2,"Region II - Northeast",null,"NEW YORK","BRONX","Walkup",127648.5425,223384.94940000001,176274.99179999999,308481.23580000002,223517.2598,391155.2046,291766.81050000002,510591.91840000002,363410.20919999998,635967.86609999998,408910.58590000001,715593.52529999998,453715.82900000003,794002.70070000004]
[2,"Region II - Northeast",null,"NEW YORK","BRONX","Elevator",142575.82949999999,228121.33059999999,199606.16130000001,319369.86290000001,256636.49309999999,410618.39510000002,342181.99080000003,547491.19350000005,427727.48859999998,684363.99190000002,484757.82040000003,775612.52410000004,541788.15220000001,866861.0564]
[2,"Region II - Northeast",null,"NEW YORK","BROOKLYN","Detached/Semi-Detached",167089.05160000001,292405.84029999998,216823.25520000001,379440.69660000002,259048.44839999999,453334.78470000002,308827.10129999998,540447.42720000003,364322.36430000002,637564.13769999996,399647.97690000001,699383.95959999994,432872.68699999998,757527.2023]
[2,"Region II - Northeast",null,"NEW YORK","BROOKLYN","Row House",140570.3222,245998.06390000001,186813.19639999999,326923.09389999998,229619.42379999999,401833.99170000001,287899.47499999998,503824.08120000002,347669.02789999999,608420.79879999999,383727.61379999999,671523.32409999997,417434.39760000003,730510.19590000005]
[2,"Region II - Northeast",null,"NEW YORK","BROOKLYN","Walkup",130019.25810000001,227533.70180000001,179629.25409999999,314351.1948,227875.1292,398781.47610000003,297667.97269999998,520918.9522,370805.4779,648909.58609999996,417334.70640000002,730335.73640000005,463178.87599999999,810563.03300000005]
[2,"Region II - Northeast",null,"NEW YORK","BROOKLYN","Elevator",144071.12059999999,230513.79639999999,201699.56880000001,322719.3149,259328.01699999999,414924.8334,345770.68939999997,553233.11129999999,432213.36180000001,691541.38910000003,489841.81,783746.90760000004,547470.25820000004,875952.42619999999]
[2,"Region II - Northeast",null,"NEW YORK","BUFFALO","Detached/Semi-Detached",135443.13939999999,237025.49400000001,175785.24979999999,307624.18719999999,210042.3553,367574.12170000002,250437.1777,438265.06099999999,295463.40990000003,517060.96730000002,324122.24320000003,567213.92559999996,351085.8861,614400.30070000002]
[2,"Region II - Northeast",null,"NEW YORK","BUFFALO","Row House",113799.1376,199148.4908,151291.74600000001,264760.55540000001,186023.0778,325540.38620000001,233356.54149999999,408373.94770000002,281871.34840000002,493274.85979999998,311128.41739999998,544474.73049999995,338485.51750000002,592349.65579999995]
[2,"Region II - Northeast",null,"NEW YORK","BUFFALO","Walkup",105163.41499999999,184035.97640000001,145271.82889999999,254225.70060000001,184266.8793,322467.03879999998,240657.00949999999,421149.76659999997,299776.97379999998,524609.70420000004,337370.93770000001,590399.14119999995,374405.77260000003,655210.10199999996]
[2,"Region II - Northeast",null,"NEW YORK","BUFFALO","Elevator",116781.38189999999,186850.21400000001,163493.93470000001,261590.29939999999,210206.48749999999,336330.38500000001,280275.31660000002,448440.5134,350344.1458,560550.64170000004,397056.6986,635290.72719999996,443769.25140000001,710030.81279999996]
[2,"Region II - Northeast",null,"NEW YORK","ELMIRA","Detached/Semi-Detached",119941.05349999999,209896.84349999999,155691.2415,272459.67259999999,186054.58499999999,325595.52370000002,221866.95910000001,388267.17849999998,261778.3328,458112.0822,287179.09389999998,502563.4142,311085.94770000002,544400.40850000002]
[2,"Region II - Northeast",null,"NEW YORK","ELMIRA","Row House",100636.908,176114.58900000001,133845.68410000001,234229.94699999999,164631.98620000001,288105.97590000002,206632.87830000001,361607.53690000001,249655.68340000001,436897.44589999999,275590.00599999999,482282.51049999997,299847.78120000003,524733.61710000003]
[2,"Region II - Northeast",null,"NEW YORK","ELMIRA","Walkup",92912.441000000006,162596.77179999999,128332.0276,224581.04829999999,162758.61429999999,284827.57510000002,212523.34049999999,371915.84590000001,264722.78360000002,463264.8713,297899.75280000002,521324.5674,330578.0392,578511.56850000005]
[2,"Region II - Northeast",null,"NEW YORK","ELMIRA","Elevator",103412.13430000001,165459.41740000001,144776.98800000001,231643.18419999999,186141.84169999999,297826.95110000001,248189.12220000001,397102.60159999999,310236.40289999999,496378.25199999998,351601.25650000002,562562.01879999996,392966.1103,628745.78579999995]
[2,"Region II - Northeast",null,"NEW YORK","JAMESTOWN","Detached/Semi-Detached",118824.2072,207942.36249999999,154346.92139999999,270107.11259999999,184540.0183,322945.03200000001,220188.65849999999,385330.15240000002,259888.48929999999,454804.85639999999,285144.23450000002,499002.41039999999,308950.09889999998,540662.67299999995]
[2,"Region II - Northeast",null,"NEW YORK","JAMESTOWN","Row House",99129.931899999996,173477.38080000001,132060.04010000001,231105.07010000001,162684.64019999999,284698.12040000001,204646.81880000001,358131.93290000001,247520.93830000001,433161.64189999999,273321.02389999997,478311.79180000001,297484.89899999998,520598.57319999998]
[2,"Region II - Northeast",null,"NEW YORK","JAMESTOWN","Walkup",91157.431500000006,159525.50520000001,125839.754,220219.56950000001,159509.01610000001,279140.7781,208099.87330000001,364174.7782,259174.6336,453555.60879999999,291569.03320000001,510245.80820000003,323454.67570000002,566045.68259999994]
[2,"Region II - Northeast",null,"NEW YORK","JAMESTOWN","Elevator",102436.40300000001,163898.24739999999,143410.96429999999,229457.54629999999,184385.52549999999,295016.84529999999,245847.36739999999,393355.79369999998,307309.20919999998,491694.74209999997,348283.77049999998,557254.04099999997,389258.33169999998,622813.34]
[2,"Region II - Northeast",null,"NEW YORK","KINGSTON","Detached/Semi-Detached",139251.9613,243690.93229999999,180796.31649999999,316393.554,216089.09280000001,378155.91239999997,257728.99479999999,451025.74099999998,304124.3493,532217.61120000004,333647.93520000001,583883.88670000003,361448.02230000001,632534.03899999999]
[2,"Region II - Northeast",null,"NEW YORK","KINGSTON","Row House",116632.9099,204107.59239999999,155199.50279999999,271599.1299,190987.86689999999,334228.7672,239878.9614,419788.1825,289920.03340000001,507360.05849999998,320068.8026,560120.4044,348280.07010000001,609490.12269999995]
[2,"Region II - Northeast",null,"NEW YORK","KINGSTON","Walkup",107548.62850000001,188210.0998,148522.9767,259915.20929999999,188333.8101,329584.16769999999,245852.91010000001,430242.59259999997,306224.80959999998,535893.41669999994,344571.44459999999,603000.02800000005,382333.76449999999,669084.08790000004]
[2,"Region II - Northeast",null,"NEW YORK","KINGSTON","Elevator",120057.18610000001,192091.50080000001,168080.0606,268928.10100000002,216102.9351,345764.70120000001,288137.24670000002,461019.6017,360171.55849999998,576274.50210000004,408194.43290000001,653111.10230000003,456217.30739999999,729947.70259999996]
[2,"Region II - Northeast",null,"NEW YORK","NEW YORK","Detached/Semi-Detached",167172.37049999999,292551.64850000001,217001.08619999999,379751.9008,259321.72020000001,453813.01030000002,309237.44040000002,541165.52080000006,364866.2464,638515.93119999999,400269.98619999998,700472.47569999995,433591.69099999999,758785.45920000004]
[2,"Region II - Northeast",null,"NEW YORK","NEW YORK","Row House",140263.56140000001,245461.23240000001,186549.7035,326461.98109999998,229459.91630000001,401554.85350000003,288002.05530000001,504003.5968,347968.00819999998,608944.01430000004,384115.50020000001,672202.12549999997,417926.36810000002,731371.14430000004]
[2,"Region II - Northeast",null,"NEW YORK","NEW YORK","Walkup",129495.6501,226617.38759999999,178860.9425,313006.64939999999,226842.0534,396973.59350000002,296199.8688,518349.77029999997,368951.5319,645665.18090000004,415190.75160000002,726583.81539999996,460734.83779999998,806285.96609999996]
[2,"Region II - Northeast",null,"NEW YORK","NEW YORK","Elevator",144134.49979999999,230615.20319999999,201788.29980000001,322861.2844,259442.09959999999,415107.36560000002,345922.79950000002,553476.48750000005,432403.49949999998,691845.60939999996,490057.29940000002,784091.69070000004,547711.09939999995,876337.772]
[2,"Region II - Northeast",null,"NEW YORK","NIAGARA FALLS","Detached/Semi-Detached",128158.79300000001,224277.88769999999,166474.46739999999,291330.31800000003,199041.99950000001,348323.49900000001,237494.9376,415616.14079999999,280317.1029,490554.92989999999,307558.9436,538228.15119999996,333237.68050000002,583165.94090000005]
[2,"Region II - Northeast",null,"NEW YORK","NIAGARA FALLS","Row House",106904.571,187082.99919999999,142422.28760000001,249239.00320000001,175455.50140000001,307047.1274,220722.06039999999,386263.60550000001,266969.94319999998,467197.40049999999,294799.24050000001,515898.67090000003,320864.3455,561512.60450000002]
[2,"Region II - Northeast",null,"NEW YORK","NIAGARA FALLS","Walkup",98298.578200000004,172022.51180000001,135696.31760000001,237468.5557,172000.75409999999,301001.3198,224392.84539999999,392687.47940000001,279465.58470000001,489064.7733,314394.17969999998,550189.81440000003,348773.71980000002,610354.00970000005]
[2,"Region II - Northeast",null,"NEW YORK","NIAGARA FALLS","Elevator",110483.3091,176773.2972,154676.63269999999,247482.61610000001,198869.95629999999,318191.935,265159.94179999997,424255.91320000001,331449.92739999999,530319.89150000003,375643.25099999999,601029.21050000004,419836.57459999999,671738.52930000005]
[2,"Region II - Northeast",null,"NEW YORK","PLATTSBURGH","Detached/Semi-Detached",125591.7953,219785.64180000001,163074.46609999999,285380.31569999998,194919.7347,341109.53570000001,232496.92739999999,406869.62280000001,274361.82669999998,480133.19660000002,301001.12099999998,526751.96169999999,326089.89480000001,570657.31590000005]
[2,"Region II - Northeast",null,"NEW YORK","PLATTSBURGH","Row House",105117.63529999999,183955.86180000001,139904.9368,244833.63939999999,172198.79790000001,301347.89630000002,216339.56969999999,378594.24709999998,261504.47200000001,457632.826,288709.66489999997,505241.91350000002,314170.62790000002,549798.59889999998]
[2,"Region II - Northeast",null,"NEW YORK","PLATTSBURGH","Walkup",96882.965200000006,169545.18919999999,133784.98050000001,234123.71580000001,169633.81409999999,296859.17469999997,221418.26490000001,387481.96360000002,275784.99119999999,482623.73460000003,310308.47289999999,543039.82759999996,344303.04869999998,602530.33519999997]
[2,"Region II - Northeast",null,"NEW YORK","PLATTSBURGH","Elevator",108278.3046,173245.29,151589.62640000001,242543.40590000001,194900.94820000001,311841.52189999999,259867.93100000001,415788.69579999999,324834.91379999998,519735.86979999999,368146.23560000001,589033.98569999996,411457.5575,658332.1017]
[2,"Region II - Northeast",null,"NEW YORK","POUGHKEEPSIE","Detached/Semi-Detached",143452.55230000001,251041.96660000001,186123.861,325716.75670000003,222346.54610000001,389106.45559999999,265039.25589999999,463818.69780000002,312642.41369999998,547124.22380000004,342947.00280000002,600157.25490000006,371440.0368,650020.06429999997]
[2,"Region II - Northeast",null,"NEW YORK","POUGHKEEPSIE","Row House",120833.6759,211458.93290000001,160527.0471,280922.33250000002,197245.32019999999,345179.31030000001,247189.2224,432581.13929999998,298438.09779999999,522266.67109999998,329367.8701,576393.77269999997,358272.0846,626976.14800000004]
[2,"Region II - Northeast",null,"NEW YORK","POUGHKEEPSIE","Walkup",111858.54610000001,195752.4558,154556.86139999999,270474.50750000001,196091.66190000001,343160.40830000001,256196.71249999999,448344.24680000002,319154.5626,558520.48459999997,359225.16470000002,628644.03819999995,398711.45169999998,697745.04040000006]
[2,"Region II - Northeast",null,"NEW YORK","POUGHKEEPSIE","Elevator",123694.08349999999,197910.53659999999,173171.7169,277074.7512,222649.35029999999,356238.96580000001,296865.80040000001,474985.28779999999,371082.25050000002,593731.60970000003,420559.88400000002,672895.82440000004,470037.51740000001,752060.03910000005]
[2,"Region II - Northeast",null,"NEW YORK","QUEENS","Detached/Semi-Detached",163488.53779999999,286104.94130000001,212256.7795,371449.36410000001,253684.90640000001,443948.58610000001,302561.1508,529482.01379999996,357021.1519,624787.01569999999,391677.33169999998,685435.33050000004,424308.08620000002,742539.15079999994]
[2,"Region II - Northeast",null,"NEW YORK","QUEENS","Row House",136969.65839999999,239696.90239999999,182246.72080000001,318931.76130000001,224255.8818,392447.79310000001,281633.5245,492858.6679,340367.81530000002,595643.67689999996,375756.96860000002,657574.69499999995,408869.79680000001,715522.14450000005]
[2,"Region II - Northeast",null,"NEW YORK","QUEENS","Walkup",126325.03569999999,221068.8124,174457.34270000001,305300.34960000002,221225.5287,387144.6752,288801.83870000002,505403.21769999998,359722.81030000001,629514.91799999995,404774.35,708355.11250000005,449140.83049999998,785996.4534]
[2,"Region II - Northeast",null,"NEW YORK","QUEENS","Elevator",140953.7738,225526.04139999999,197335.28330000001,315736.45799999998,253716.7928,405946.87449999998,338289.05709999998,541262.49939999997,422861.32130000001,676578.12419999996,479242.8309,766788.54079999996,535624.34030000004,856998.95739999996]
[2,"Region II - Northeast",null,"NEW YORK","ROCHESTER","Detached/Semi-Detached",128675.55130000001,225182.21470000001,167057.70509999999,292350.9841,199662.63889999999,349409.61810000002,238128.90890000001,416725.5906,280990.07260000001,491732.62709999998,308265.3567,539464.37430000002,333946.09019999998,584405.65780000004]
[2,"Region II - Northeast",null,"NEW YORK","ROCHESTER","Row House",107811.4341,188670.0097,143446.8492,251031.98610000001,176508.92009999999,308890.6103,221663.79060000001,387911.6335,267887.81469999999,468803.67570000002,295739.77649999998,517544.60879999999,321799.78850000002,563149.63]
[2,"Region II - Northeast",null,"NEW YORK","ROCHESTER","Walkup",99437.881399999998,174016.29250000001,137326.60250000001,240321.55429999999,174142.08129999999,304748.6422,227338.61780000001,397842.58110000001,283166.61619999999,495541.57829999999,318631.49810000003,557605.12179999996,353557.39970000001,618725.44940000004]
[2,"Region II - Northeast",null,"NEW YORK","ROCHESTER","Elevator",110939.48050000001,177503.17139999999,155315.2726,248504.4399,199691.06469999999,319505.7084,266254.75300000003,426007.61119999998,332818.44130000001,532509.51399999997,377194.23349999997,603510.78260000004,421570.0257,674512.05110000004]
[2,"Region II - Northeast",null,"NEW YORK","SCHENECTADY","Detached/Semi-Detached",133601.21590000001,233802.12779999999,173413.08739999999,303472.90299999999,207223.93780000001,362641.891,247099.02040000001,432423.28570000001,291540.8481,510196.48420000001,319825.90019999997,559695.32519999996,346444.06670000002,606277.11679999996]
[2,"Region II - Northeast",null,"NEW YORK","SCHENECTADY","Row House",112152.179,196266.31330000001,149140.24549999999,260995.42970000001,183421.05,320986.83740000002,230172.26370000001,402801.46149999998,278071.23759999999,486624.66570000001,306949.13579999999,537160.98750000005,333957.21490000002,584425.12609999999]
[2,"Region II - Northeast",null,"NEW YORK","SCHENECTADY","Walkup",103578.10060000001,181261.67600000001,143070.01869999999,250372.53279999999,181458.60380000001,317552.55660000001,236957.9768,414676.4595,295162.59100000001,516534.5343,332162.712,581284.74600000004,368608.74109999998,645065.29689999996]
[2,"Region II - Northeast",null,"NEW YORK","SCHENECTADY","Elevator",115191.01270000001,184305.6231,161267.4178,258027.87239999999,207343.8229,331750.12160000001,276458.43050000002,442333.49550000002,345573.03820000001,552916.86939999997,391649.44329999998,626639.11860000005,437725.84840000002,700361.36789999995]
[2,"Region II - Northeast",null,"NEW YORK","STATEN ISLAND","Detached/Semi-Detached",157154.38140000001,275020.16749999998,203934.63140000001,356885.60509999999,243652.5454,426391.95439999999,290476.49920000002,508333.8737,342676.88459999999,599684.54799999995,375904.8297,657833.45180000004,407157.67479999998,712525.93079999997]
[2,"Region II - Northeast",null,"NEW YORK","STATEN ISLAND","Row House",132195.57370000001,231342.25390000001,175689.87119999999,307457.2746,215954.64079999999,377920.6214,270779.9105,473864.84330000001,327003.15659999999,572255.52410000004,360920.95899999997,631611.67819999997,392627.52059999999,687098.16099999996]
[2,"Region II - Northeast",null,"NEW YORK","STATEN ISLAND","Walkup",122262.40889999999,213959.21580000001,168910.70699999999,295593.73739999998,214275.12659999999,374981.47159999999,279897.31449999998,489820.3003,348667.4191,610167.98340000003,392416.1715,686728.30020000006,435520.16230000003,762160.28410000005]
[2,"Region II - Northeast",null,"NEW YORK","STATEN ISLAND","Elevator",135504.65779999999,216807.45569999999,189706.5209,303530.43800000002,243908.38399999999,390253.42019999999,325211.17869999999,520337.89370000002,406513.97340000002,650422.36710000003,460715.83649999998,737145.34939999995,514917.6997,823868.33160000003]
[2,"Region II - Northeast",null,"NEW YORK","SYRACUSE","Detached/Semi-Detached",128675.55130000001,225182.21470000001,167057.70509999999,292350.9841,199662.63889999999,349409.61810000002,238128.90890000001,416725.5906,280990.07260000001,491732.62709999998,308265.3567,539464.37430000002,333946.09019999998,584405.65780000004]
[2,"Region II - Northeast",null,"NEW YORK","SYRACUSE","Row House",107811.4341,188670.0097,143446.8492,251031.98610000001,176508.92009999999,308890.6103,221663.79060000001,387911.6335,267887.81469999999,468803.67570000002,295739.77649999998,517544.60879999999,321799.78850000002,563149.63]
[2,"Region II - Northeast",null,"NEW YORK","SYRACUSE","Walkup",99437.881399999998,174016.29250000001,137326.60250000001,240321.55429999999,174142.08129999999,304748.6422,227338.61780000001,397842.58110000001,283166.61619999999,495541.57829999999,318631.49810000003,557605.12179999996,353557.39970000001,618725.44940000004]
[2,"Region II - Northeast",null,"NEW YORK","SYRACUSE","Elevator",110939.48050000001,177503.17139999999,155315.2726,248504.4399,199691.06469999999,319505.7084,266254.75300000003,426007.61119999998,332818.44130000001,532509.51399999997,377194.23349999997,603510.78260000004,421570.0257,674512.05110000004]
[2,"Region II - Northeast",null,"NEW YORK","UTICA","Detached/Semi-Detached",126791.9641,221885.93729999999,164596.62169999999,288044.08789999998,196707.5785,344238.26240000001,234585.57329999999,410524.75339999999,276795.55930000002,484392.22879999998,303657.9975,531401.49549999996,328944.7561,575653.32310000004]
[2,"Region II - Northeast",null,"NEW YORK","UTICA","Row House",106317.8542,186056.24479999999,141427.09229999999,247497.41149999999,173986.64170000001,304476.62290000002,218428.21580000001,382249.37760000001,263938.2047,461891.85810000001,291366.54129999998,509891.4473,317025.48920000001,554794.60620000004]
[2,"Region II - Northeast",null,"NEW YORK","UTICA","Walkup",98114.370299999995,171700.14809999999,135508.94750000001,237140.65820000001,171850.3432,300738.10060000001,224373.63699999999,392653.86489999999,279479.20630000002,489088.61119999998,314495.25,550366.68759999995,348982.38780000003,610719.17870000005]
[2,"Region II - Northeast",null,"NEW YORK","UTICA","Elevator",109317.4181,174907.87160000001,153044.38529999999,244871.0203,196771.35260000001,314834.16889999999,262361.80349999998,419778.89189999999,327952.25439999998,524723.61479999998,371679.22169999999,594686.76340000005,415406.18890000001,664649.91209999996]
[2,"Region II - Northeast",null,"NEW YORK","WATERTOWN","Detached/Semi-Detached",119982.71649999999,209969.75399999999,155780.16149999999,272615.28269999998,186191.2262,325834.6458,222072.13500000001,388626.23619999998,262050.28099999999,458587.99170000001,287490.10639999999,503107.6862,311445.45819999999,545029.55189999996]
[2,"Region II - Northeast",null,"NEW YORK","WATERTOWN","Row House",100483.53109999999,175846.1795,133713.94209999999,233999.39859999999,164552.2378,287966.41609999997,206684.1747,361697.30560000002,249805.1807,437159.06630000001,275783.9571,482621.92499999999,300093.77490000002,525164.10620000004]
[2,"Region II - Northeast",null,"NEW YORK","WATERTOWN","Walkup",92650.640700000004,162138.62109999999,127947.8769,223908.78460000001,162242.08300000001,283923.64539999998,211789.29740000001,370631.27039999998,263795.82169999997,461642.68790000002,296827.7879,519448.6287,329356.03409999999,576373.05960000004]
[2,"Region II - Northeast",null,"NEW YORK","WATERTOWN","Elevator",103443.827,165510.1257,144821.3578,231714.1759,186198.88860000001,297918.22619999998,248265.18470000001,397224.3015,310331.48090000002,496530.37699999998,351709.01179999998,562734.42720000003,393086.54259999999,628938.47750000004]
[2,"Region II - Northeast",null,"NEW YORK","YONKERS","Detached/Semi-Detached",159971.35750000001,279949.87560000003,207868.15289999999,363769.26760000002,248594.6574,435040.65049999999,296705.56449999998,519234.7377,350263.8504,612961.73809999996,384328.72739999997,672575.27280000004,416462.5233,728809.41590000002]
[2,"Region II - Northeast",null,"NEW YORK","YONKERS","Row House",133062.24830000001,232858.9345,177416.7702,310479.34789999999,218732.8535,382782.49369999999,275470.17930000002,482072.8137,333365.61210000003,583389.82120000001,368174.2415,644304.92260000005,400797.20059999998,701395.10100000002]
[2,"Region II - Northeast",null,"NEW YORK","YONKERS","Walkup",122107.21980000001,213687.63459999999,168517.14,294904.9951,213542.87890000001,373700.038,278467.636,487318.36290000001,346786.24099999998,606875.92169999995,390070.08860000002,682622.65500000003,432658.8026,757152.90460000001]
[2,"Region II - Northeast",null,"NEW YORK","YONKERS","Elevator",137899.8186,220639.71299999999,193059.74600000001,308895.59830000001,248219.6735,397151.48340000003,330959.56459999998,529535.31129999994,413699.4558,661919.13910000003,468859.38329999999,750175.02430000005,524019.31069999997,838430.90960000001]
[2,"Region II - Northeast",null,"PUERTO RICO","SAN JUAN","Detached/Semi-Detached",133126.1207,232970.71119999999,172918.7697,302607.84700000001,206739.93950000001,361794.89419999998,246670.2249,431672.89350000001,291139.82659999997,509494.69650000002,319430.49959999998,559003.37419999996,346095.16749999998,605666.54319999996]
[2,"Region II - Northeast",null,"PUERTO RICO","SAN JUAN","Row House",111091.9391,194410.8933,147983.94190000001,258971.8982,182287.88269999999,319003.79470000003,229281.82990000001,401243.2022,277302.86339999997,485280.01089999999,306202.55099999998,535854.46420000005,333267.76559999998,583218.58959999995]
[2,"Region II - Northeast",null,"PUERTO RICO","SAN JUAN","Walkup",102176.997,178809.74470000001,141055.58309999999,246847.27050000001,178800.74530000001,312901.30430000002,233278.16130000001,408236.78220000002,290534.59769999998,508435.54580000002,326853.42859999998,571993.50009999995,362603.05609999999,634555.34809999994]
[2,"Region II - Northeast",null,"PUERTO RICO","SAN JUAN","Elevator",114766.5341,183626.45740000001,160673.14780000001,257077.04029999999,206579.76139999999,330527.62310000003,275439.68190000003,440703.4975,344299.60239999997,550879.37199999997,390206.21600000001,624329.95479999995,436112.8296,697780.53780000005]
[2,"Region II - Northeast",null,"VIRGIN ISLANDS","ST. CROIX","Detached/Semi-Detached",169014.2941,295775.0147,219373.24859999999,383903.185,262140.13769999999,458745.24109999998,312575.59779999999,547007.29610000004,368788.80820000003,645380.41429999995,404566.32919999998,707991.07609999995,438233.51030000002,766908.64309999999]
[2,"Region II - Northeast",null,"VIRGIN ISLANDS","ST. CROIX","Row House",141910.51990000001,248343.4099,188701.20389999999,330227.10680000001,232061.94409999999,406108.40220000001,291186.33319999999,509576.08299999998,351768.11900000001,615594.20830000006,388294.7819,679515.86840000004,422454.67080000002,739295.67390000005]
[2,"Region II - Northeast",null,"VIRGIN ISLANDS","ST. CROIX","Walkup",131080.96460000001,229391.6881,181062.75270000001,316859.8173,229650.32889999999,401888.07569999999,299898.90139999997,524823.07739999995,373565.91470000002,653740.35080000001,420398.97739999997,735698.21050000004,466531.86930000002,816430.77139999997]
[2,"Region II - Northeast",null,"VIRGIN ISLANDS","ST. CROIX","Elevator",145724.86910000001,233159.79389999999,204014.81659999999,326423.71149999998,262304.76429999998,419687.62900000002,349739.68569999997,559583.50549999997,437174.60710000002,699479.38179999997,495464.55479999998,792743.29929999996,553754.50230000005,886007.21699999995]
[2,"Region II - Northeast",null,"VIRGIN ISLANDS","ST. JOHN","Detached/Semi-Detached",179282.26180000001,313743.95809999999,232973.22339999999,407703.14110000001,278629.15990000003,487601.02980000002,332567.59399999998,581993.28940000001,392609.85969999997,687067.25450000004,430797.56089999998,753895.73149999999,466824.5894,816943.03150000004]
[2,"Region II - Northeast",null,"VIRGIN ISLANDS","ST. JOHN","Row House",149058.24660000001,260851.93160000001,198770.58439999999,347848.52269999997,245088.72889999999,428905.27559999999,308716.2562,540253.44839999999,373629.95490000001,653852.42110000004,412653.03019999998,722142.8027,449229.48090000002,786151.59169999999]
[2,"Region II - Northeast",null,"VIRGIN ISLANDS","ST. JOHN","Walkup",136743.40349999999,239300.95619999999,188708.08410000001,330239.1471,239118.06789999999,418456.6189,311797.19679999998,545645.09420000005,388288.25599999999,679504.44790000003,436741.76789999998,764298.09389999998,484414.51400000002,847725.39950000006]
[2,"Region II - Northeast",null,"VIRGIN ISLANDS","ST. JOHN","Elevator",154544.86739999999,247271.79149999999,216362.8143,346180.50809999998,278180.76120000001,445089.22460000002,370907.68170000002,593452.29949999996,463634.60210000002,741815.37450000003,525452.54909999995,840724.09100000001,587270.49600000004,939632.80759999994]
[2,"Region II - Northeast",null,"VIRGIN ISLANDS","ST. THOMAS","Detached/Semi-Detached",170297.78909999999,298021.13089999999,221073.24419999999,386878.17739999999,264201.26390000002,462352.212,315074.59539999999,551380.54189999995,371766.4374,650591.26549999998,407845.23070000001,713729.15370000002,441807.39250000002,773162.93700000003]
[2,"Region II - Northeast",null,"VIRGIN ISLANDS","ST. THOMAS","Row House",142803.98509999999,249906.97399999999,189959.87549999999,332429.78220000002,233690.291,408958.00929999998,293377.57189999998,513410.75079999998,354500.84649999999,620376.48140000005,391339.56069999997,684844.23120000004,425801.5196,745152.65930000006]
[2,"Region II - Northeast",null,"VIRGIN ISLANDS","ST. THOMAS","Walkup",131788.7689,230630.34570000001,182018.4184,318532.23229999997,230833.79550000001,403959.1421,301386.18719999999,527425.82759999996,375406.20600000001,656960.86049999995,422441.8247,739273.19330000004,468767.19829999999,820342.59699999995]
[2,"Region II - Northeast",null,"VIRGIN ISLANDS","ST. THOMAS","Elevator",146827.36799999999,234923.79240000001,205558.31520000001,328893.30920000002,264289.26240000001,422862.82610000001,352385.68320000003,563817.10160000005,440482.1041,704771.37690000003,499213.05129999999,798740.89379999996,557943.99840000004,892710.41079999995]
[3,"Region III -",null,"DELAWARE","DOVER","Detached/Semi-Detached",130434.1338,228259.73420000001,169252.00829999999,296191.01459999999,202207.75109999999,353863.56439999997,241056.68719999999,421849.20250000001,284368.70559999999,497645.23479999998,311939.63939999999,545894.36880000005,337868.8504,591270.48809999996]
[3,"Region III -",null,"DELAWARE","DOVER","Row House",109765.1339,192088.98439999999,145861.81700000001,255258.17970000001,179270.4246,313723.24300000002,224745.45009999999,393304.53779999999,271388.90000000002,474930.57500000001,299531.12180000002,524179.4632,325836.06679999997,570213.11679999996]
[3,"Region III -",null,"DELAWARE","DOVER","Walkup",101546.78509999999,177706.87400000001,140296.69810000001,245519.22159999999,177983.39920000001,311470.9485,232505.71030000001,406884.99300000002,289634.88990000001,506861.05729999999,325983.61660000001,570471.32920000004,361798.40029999998,633147.20050000004]
[3,"Region III -",null,"DELAWARE","DOVER","Elevator",112466.45140000001,179946.32509999999,157453.03210000001,251924.85500000001,202439.61259999999,323903.38500000001,269919.48349999997,431871.1801,337399.35430000001,539838.97499999998,382385.935,611817.505,427372.51559999998,683796.03500000003]
[3,"Region III -",null,"DELAWARE","WILMINGTON","Detached/Semi-Detached",133001.13140000001,232751.98009999999,172652.00959999999,302141.01689999999,206330.01579999999,361077.52769999998,246054.6974,430595.7205,290323.98180000001,508066.9681,318497.46189999999,557370.55830000003,345016.6361,603779.11309999996]
[3,"Region III -",null,"DELAWARE","WILMINGTON","Row House",111552.0696,195216.12179999999,148379.16769999999,259663.5436,182527.1281,319422.47409999999,229127.94070000001,400973.89620000002,276854.3713,484495.1496,305620.69750000001,534836.2206,332529.7843,581927.12250000006]
[3,"Region III -",null,"DELAWARE","WILMINGTON","Walkup",102962.398,180184.19649999999,142208.03520000001,248864.06159999999,180350.33919999999,315613.09360000002,235480.29070000001,412090.50880000001,293315.48340000003,513302.09600000002,330069.32339999999,577621.31599999999,366269.07140000002,640970.87509999995]
[3,"Region III -",null,"DELAWARE","WILMINGTON","Elevator",114671.45600000001,183474.33230000001,160540.03829999999,256864.06520000001,206408.6208,330253.79800000001,275211.49430000002,440338.39750000002,344014.36790000001,550422.99679999996,389882.95030000003,623812.72970000003,435751.53269999998,697202.46270000003]
[3,"Region III -",null,"DISTRICT OF COLUMBIA","WASHINGTON","Detached/Semi-Detached",123149.79090000001,215512.1342,159941.23050000001,279897.15330000001,191207.40049999999,334612.951,228114.45319999999,399200.29320000001,269222.40580000001,471139.21010000003,295376.34759999998,516908.60830000002,320020.6532,560036.14320000005]
[3,"Region III -",null,"DISTRICT OF COLUMBIA","WASHINGTON","Row House",102870.57090000001,180023.49909999999,136992.36309999999,239736.6355,168702.85339999999,295229.99349999998,212110.97519999999,371194.20649999997,256487.50200000001,448853.12849999999,283201.95289999997,495603.41759999999,308214.9032,539376.08050000004]
[3,"Region III -",null,"DISTRICT OF COLUMBIA","WASHINGTON","Walkup",94681.951799999995,165693.41570000001,130721.19190000001,228762.0857,165717.2806,290005.24109999998,216241.55499999999,378422.72129999998,269323.51179999998,471316.14569999999,303006.87099999998,530262.02430000005,336166.3615,588291.13249999995]
[3,"Region III -",null,"DISTRICT OF COLUMBIA","WASHINGTON","Elevator",106168.3817,169869.41329999999,148635.73439999999,237817.17860000001,191103.0871,305764.94380000001,254804.11610000001,407686.59179999999,318505.14510000002,509608.23979999998,360972.49780000001,577556.00509999995,403439.8505,645503.77040000004]
[3,"Region III -",null,"MARYLAND","BALTIMORE","Detached/Semi-Detached",119340.969,208846.69579999999,154930.1637,271127.78649999999,185160.66310000001,324031.16039999999,220822.6361,386439.61320000002,260561.4664,455982.5662,285850.6556,500238.64730000001,309658.5171,541902.40489999996]
[3,"Region III -",null,"MARYLAND","BALTIMORE","Row House",100036.79859999999,175064.39749999999,133084.60630000001,232898.06099999999,163738.0644,286541.61259999999,205588.55530000001,359779.97169999999,248438.81709999999,434767.92979999998,274261.56770000001,479957.74359999999,298420.3505,522235.61349999998]
[3,"Region III -",null,"MARYLAND","BALTIMORE","Walkup",92296.738500000007,161519.29240000001,127470.04399999999,223072.57709999999,161650.3498,282888.11219999997,211045.6545,369329.89529999997,262875.67609999998,460032.43300000002,295806.36420000001,517661.1373,328238.36959999998,574417.14670000004]
[3,"Region III -",null,"MARYLAND","BALTIMORE","Elevator",102892.5775,164628.12650000001,144049.6085,230479.37710000001,185206.63949999999,296330.62760000001,246942.18599999999,395107.50349999999,308677.73249999998,493884.37939999998,349834.7635,559735.62990000006,390991.79450000002,625586.88060000003]
[3,"Region III -",null,"MARYLAND","CUMBERLAND","Detached/Semi-Detached",117624.0384,205842.06709999999,152824.7659,267443.34039999999,182752.17449999999,319816.30540000001,218100.01259999999,381675.022,257454.75659999999,450545.82419999997,282487.35800000001,494352.87650000001,306095.23759999999,535666.66579999996]
[3,"Region III -",null,"MARYLAND","CUMBERLAND","Row House",97929.713099999994,171376.99789999999,130537.8845,228441.29790000001,160896.79639999999,281569.39370000002,202558.1728,354476.80239999999,245087.20559999999,428902.60960000003,270664.14740000002,473662.25799999997,294630.03769999999,515602.56599999999]
[3,"Region III -",null,"MARYLAND","CUMBERLAND","Walkup",89926.026500000007,157370.54639999999,124115.78690000001,217202.62710000001,157292.48699999999,275261.85220000002,205144.50109999999,359002.87699999998,255480.4184,447090.73229999997,287382.2561,502918.94819999998,318775.33659999998,557856.83900000004]
[3,"Region III -",null,"MARYLAND","CUMBERLAND","Elevator",101397.2896,162235.66570000001,141956.20540000001,227129.932,182515.12109999999,292024.19829999999,243353.49489999999,389365.59759999998,304191.86859999999,486706.99709999998,344750.7844,551601.26329999999,385309.70020000002,616495.52960000001]
[3,"Region III -",null,"MARYLAND","HAGERSTOWN","Detached/Semi-Detached",118824.2072,207942.36249999999,154346.92139999999,270107.11259999999,184540.0183,322945.03200000001,220188.65849999999,385330.15240000002,259888.48929999999,454804.85639999999,285144.23450000002,499002.41039999999,308950.09889999998,540662.67299999995]
[3,"Region III -",null,"MARYLAND","HAGERSTOWN","Row House",99129.931899999996,173477.38080000001,132060.04010000001,231105.07010000001,162684.64019999999,284698.12040000001,204646.81880000001,358131.93290000001,247520.93830000001,433161.64189999999,273321.02389999997,478311.79180000001,297484.89899999998,520598.57319999998]
[3,"Region III -",null,"MARYLAND","HAGERSTOWN","Walkup",91157.431500000006,159525.50520000001,125839.754,220219.56950000001,159509.01610000001,279140.7781,208099.87330000001,364174.7782,259174.6336,453555.60879999999,291569.03320000001,510245.80820000003,323454.67570000002,566045.68259999994]
[3,"Region III -",null,"MARYLAND","HAGERSTOWN","Elevator",102436.40300000001,163898.24739999999,143410.96429999999,229457.54629999999,184385.52549999999,295016.84529999999,245847.36739999999,393355.79369999998,307309.20919999998,491694.74209999997,348283.77049999998,557254.04099999997,389258.33169999998,622813.34]
[3,"Region III -",null,"MARYLAND","SILVER SPRING","Detached/Semi-Detached",117023.95389999999,204791.91940000001,152063.6882,266111.45429999998,181858.25260000001,318251.94209999999,217055.68960000001,379847.45669999998,256237.8903,448416.30800000002,281158.91979999997,492028.10960000003,304667.80699999997,533168.66220000002]
[3,"Region III -",null,"MARYLAND","SILVER SPRING","Row House",97329.603600000002,170326.8063,129776.80680000001,227109.4117,160002.87450000001,280005.03049999999,201513.8498,352649.23719999997,243870.33919999999,426773.09350000002,269335.70919999998,471337.49109999998,293202.60700000002,513104.56229999999]
[3,"Region III -",null,"MARYLAND","SILVER SPRING","Walkup",89310.323999999993,156293.06700000001,123253.8034,215694.15590000001,156184.2225,273322.38929999998,203666.81510000001,356416.9264,253633.31090000001,443858.29399999999,285288.86749999999,499255.51809999999,316435.66700000002,553762.41709999996]
[3,"Region III -",null,"MARYLAND","SILVER SPRING","Elevator",100877.73269999999,161404.3749,141228.8259,225966.12479999999,181579.91889999999,290527.87469999999,242106.55859999999,387370.49959999998,302633.19829999999,484213.12459999998,342984.29139999999,548774.87450000003,383335.38449999999,613336.62439999997]
[3,"Region III -",null,"PENNSYLVANIA","ALLENTOWN","Detached/Semi-Detached",134326.28950000001,235071.0067,174440.9253,305271.61920000002,208527.78330000001,364923.62079999998,248758.87090000001,435328.02409999998,293573.55920000002,513753.72869999998,322087.37599999999,563652.90800000005,348950.02870000002,610662.55039999995]
[3,"Region III -",null,"PENNSYLVANIA","ALLENTOWN","Row House",112292.15790000001,196511.2764,149506.0974,261635.67050000001,184075.72649999999,322132.52130000002,231370.47579999999,404898.33270000003,279736.59600000002,489539.04300000001,308859.42739999999,540503.99789999996,336122.62680000003,588214.5969]
[3,"Region III -",null,"PENNSYLVANIA","ALLENTOWN","Walkup",103408.402,180964.7035,142779.55009999999,249864.21280000001,181017.27439999999,316780.23019999999,236233.53339999999,413408.68349999998,294228.81280000001,514900.42239999998,331040.2058,579320.36010000005,367282.39529999997,642744.19169999997]
[3,"Region III -",null,"PENNSYLVANIA","ALLENTOWN","Elevator",115805.6476,185289.03899999999,162127.90669999999,259404.65470000001,208450.16570000001,333520.27020000003,277933.55440000002,444693.6936,347416.94290000002,555867.11710000003,393739.20209999999,629982.73259999999,440061.46100000001,704098.34820000001]
[3,"Region III -",null,"PENNSYLVANIA","ALTOONA","Detached/Semi-Detached",122074.6154,213630.57699999999,158685.8406,277700.22100000002,189829.48740000001,332201.6029,226641.34340000001,396622.35100000002,267604.52840000001,468307.92469999997,293652.52039999998,513891.9106,318244.33620000002,556927.58829999994]
[3,"Region III -",null,"PENNSYLVANIA","ALTOONA","Row House",101210.22319999999,177117.89079999999,135074.9846,236381.2231,166675.76869999999,291682.59519999998,210176.22519999999,367808.39390000002,254502.27050000001,445378.97330000001,281126.94010000001,491972.14510000002,306098.03450000001,535671.56050000002]
[3,"Region III -",null,"PENNSYLVANIA","ALTOONA","Walkup",92665.146299999993,162164.00599999999,127844.7732,223728.35320000001,161951.1581,283414.52659999998,211084.05350000001,369397.09360000002,262848.41080000001,459984.71889999998,295604.19870000001,517307.34779999999,327821.0062,573686.76080000005]
[3,"Region III -",null,"PENNSYLVANIA","ALTOONA","Elevator",105224.3498,168358.96230000001,147314.08970000001,235702.54699999999,189403.8296,303046.13189999998,252538.43950000001,404061.50919999997,315673.04930000001,505076.88650000002,357762.7893,572420.47140000004,399852.52919999999,639764.05630000005]
[3,"Region III -",null,"PENNSYLVANIA","ERIE","Detached/Semi-Detached",125633.45480000001,219858.5459,163163.38159999999,285535.9178,195056.37059999999,341348.64850000001,232702.09700000001,407228.66960000002,274633.76760000002,480609.09330000001,301312.12560000003,527296.21979999996,326449.39679999999,571286.44429999997]
[3,"Region III -",null,"PENNSYLVANIA","ERIE","Row House",104964.2549,183687.44620000001,139773.19029999999,244603.08300000001,172119.0441,301208.3272,216390.85990000001,378684.0049,261653.9621,457894.43369999999,288903.60810000001,505581.31410000002,314416.61320000002,550229.07310000004]
[3,"Region III -",null,"PENNSYLVANIA","ERIE","Walkup",96621.161300000007,169087.03219999999,133400.82459999999,233451.4431,169117.27619999999,295955.23330000002,220684.21299999999,386197.37270000001,274858.0183,481001.5319,309236.49540000001,541163.86710000003,343081.0295,600391.80169999995]
[3,"Region III -",null,"PENNSYLVANIA","ERIE","Elevator",108309.99430000001,173295.99340000001,151633.99189999999,242614.39060000001,194957.9895,311932.788,259943.98610000001,415910.38390000002,324929.98269999999,519887.98,368253.9803,589206.37730000005,411577.978,658524.7746]
[3,"Region III -",null,"PENNSYLVANIA","HARRISBURG","Detached/Semi-Detached",124908.3847,218589.67329999999,162135.54829999999,283737.2095,193752.53030000001,339066.92810000002,231042.25270000001,404323.94219999999,272601.0638,477051.8615,299050.65769999998,523338.65090000001,323943.44319999998,566901.02560000005]
[3,"Region III -",null,"PENNSYLVANIA","HARRISBURG","Row House",104824.27959999999,183442.48929999999,139407.34289999999,243962.85010000001,171464.37289999999,300062.65259999997,215192.65400000001,376587.14449999999,259988.6109,454980.06890000001,286993.32439999998,502238.3175,312251.20980000001,546439.61719999998]
[3,"Region III -",null,"PENNSYLVANIA","HARRISBURG","Walkup",96790.863500000007,169384.0111,133691.29829999999,233959.77189999999,169558.6122,296727.57120000001,221408.66519999999,387465.16409999999,275791.8075,482635.66310000001,310359.01419999998,543128.27489999996,344407.38939999999,602712.93130000005]
[3,"Region III -",null,"PENNSYLVANIA","HARRISBURG","Elevator",107695.3624,172312.58240000001,150773.5073,241237.61540000001,193851.65229999999,310162.6483,258468.86970000001,413550.19770000002,323086.08720000001,516937.74719999998,366164.23210000002,585862.78,409242.37709999998,654787.81310000003]
[3,"Region III -",null,"PENNSYLVANIA","JOHNSTOWN","Detached/Semi-Detached",120149.3653,210261.38930000001,156135.8371,273237.71480000002,186737.78580000001,326791.1251,222892.83199999999,390062.45610000001,263138.06689999998,460491.61690000002,288734.14850000001,505284.7599,312883.4915,547546.11029999994]
[3,"Region III -",null,"PENNSYLVANIA","JOHNSTOWN","Row House",99870.020199999999,174772.53539999999,133186.96969999999,233077.19699999999,164233.23869999999,287408.16759999999,206889.35389999999,362056.36930000002,250403.16310000001,438205.53529999999,276559.75380000001,483979.56910000002,301077.7414,526886.04760000005]
[3,"Region III -",null,"PENNSYLVANIA","JOHNSTOWN","Walkup",91603.435500000007,160306.0122,126411.269,221219.72080000001,160175.95129999999,280307.91470000002,208853.1159,365492.95289999997,260087.96290000001,455153.9351,292539.91560000001,511944.85230000003,324467.99949999998,567818.99919999996]
[3,"Region III -",null,"PENNSYLVANIA","JOHNSTOWN","Elevator",103570.59480000001,165712.95420000001,144998.83259999999,231998.13570000001,186427.07060000001,298283.3174,248569.42739999999,397711.08980000002,310711.7843,497138.86229999998,352140.02220000001,563424.04390000005,393568.26010000001,629709.22549999994]
[3,"Region III -",null,"PENNSYLVANIA","LANCASTER","Detached/Semi-Detached",123149.79090000001,215512.1342,159941.23050000001,279897.15330000001,191207.40049999999,334612.951,228114.45319999999,399200.29320000001,269222.40580000001,471139.21010000003,295376.34759999998,516908.60830000002,320020.6532,560036.14320000005]
[3,"Region III -",null,"PENNSYLVANIA","LANCASTER","Row House",102870.57090000001,180023.49909999999,136992.36309999999,239736.6355,168702.85339999999,295229.99349999998,212110.97519999999,371194.20649999997,256487.50200000001,448853.12849999999,283201.95289999997,495603.41759999999,308214.9032,539376.08050000004]
[3,"Region III -",null,"PENNSYLVANIA","LANCASTER","Walkup",94681.951799999995,165693.41570000001,130721.19190000001,228762.0857,165717.2806,290005.24109999998,216241.55499999999,378422.72129999998,269323.51179999998,471316.14569999999,303006.87099999998,530262.02430000005,336166.3615,588291.13249999995]
[3,"Region III -",null,"PENNSYLVANIA","LANCASTER","Elevator",106168.3817,169869.41329999999,148635.73439999999,237817.17860000001,191103.0871,305764.94380000001,254804.11610000001,407686.59179999999,318505.14510000002,509608.23979999998,360972.49780000001,577556.00509999995,403439.8505,645503.77040000004]
[3,"Region III -",null,"PENNSYLVANIA","NORRISTOWN","Detached/Semi-Detached",140102.02470000001,245178.54319999999,182090.91560000001,318659.10220000002,217802.86369999999,381155.01130000001,260004.37530000001,455007.6568,306972.90850000002,537202.58979999996,336842.4523,589474.2916,365032.52,638806.91020000004]
[3,"Region III -",null,"PENNSYLVANIA","NORRISTOWN","Row House",116312.7565,203547.32380000001,155170.12719999999,271547.72259999998,191403.2971,334955.77,241231.06330000001,422154.36070000002,292033.88589999999,511059.3002,322560.94990000001,564481.66240000003,351183.46620000002,614571.06590000005]
[3,"Region III -",null,"PENNSYLVANIA","NORRISTOWN","Walkup",106593.5258,186538.67,147080.05160000001,257390.09030000001,186342.88070000001,326100.04119999998,242926.3285,425121.0748,302510.13449999999,529392.73540000001,340233.0307,595407.80390000006,377341.38860000001,660347.43019999994]
[3,"Region III -",null,"PENNSYLVANIA","NORRISTOWN","Elevator",120766.8996,193227.0423,169073.65950000001,270517.8591,217380.41930000001,347808.67599999998,289840.55900000001,463744.90130000003,362300.69870000001,579681.12670000002,410607.45860000001,656971.94350000005,458914.21840000001,734262.76040000003]
[3,"Region III -",null,"PENNSYLVANIA","PHILADELPHIA","Detached/Semi-Detached",148461.55069999999,259807.7138,192657.09340000001,337149.91340000002,230181.13959999999,402816.99430000002,274419.734,480234.5344,323737.10340000002,566539.93099999998,355129.59090000001,621476.78399999999,384657.05550000002,673149.84719999996]
[3,"Region III -",null,"PENNSYLVANIA","PHILADELPHIA","Row House",124867.6724,218518.42679999999,165956.96710000001,290424.6924,203997.96280000001,356996.43489999999,255800.3014,447650.52740000002,308920.53169999999,540610.93039999995,340965.14990000002,596689.01229999994,370921.5184,649112.65720000002]
[3,"Region III -",null,"PENNSYLVANIA","PHILADELPHIA","Walkup",115475.1688,202081.5454,159531.98199999999,279180.96860000002,202375.12890000001,354156.4755,264347.99410000001,462608.98969999998,329296.62459999998,576269.09290000005,370612.46090000001,648571.80660000001,411318.79609999998,719807.89309999999]
[3,"Region III -",null,"PENNSYLVANIA","PHILADELPHIA","Elevator",128009.00780000001,204814.41560000001,179212.611,286740.18180000002,230416.21410000001,368665.94799999997,307221.6188,491554.59730000002,384027.02350000001,614443.24670000002,435230.62660000002,696369.01289999997,486434.22970000003,778294.77919999999]
[3,"Region III -",null,"PENNSYLVANIA","PITTSBURGH","Detached/Semi-Detached",129917.3832,227355.42060000001,168668.7807,295170.36629999999,201587.12400000001,352777.4669,240422.73069999999,420739.77879999997,283695.7536,496467.5687,311233.24579999998,544658.18000000005,337160.462,590030.80839999998]
[3,"Region III -",null,"PENNSYLVANIA","PITTSBURGH","Row House",108858.27619999999,190501.98319999999,144837.26269999999,253465.20989999999,178217.01550000001,311879.77710000001,223803.73300000001,391656.53269999998,270471.04479999997,473324.3284,298590.6041,522533.55709999998,324900.64360000001,568576.12620000006]
[3,"Region III -",null,"PENNSYLVANIA","PITTSBURGH","Walkup",100407.48609999999,175713.10070000001,138666.41880000001,242666.23300000001,175842.0791,307723.6384,229559.94680000001,401729.9068,285933.86940000003,500384.27149999997,321746.31040000002,563056.04319999996,357014.73379999999,624775.78410000005]
[3,"Region III -",null,"PENNSYLVANIA","PITTSBURGH","Elevator",112010.28660000001,179216.4614,156814.4014,250903.0459,201618.51610000001,322589.63040000002,268824.68800000002,430119.5073,336030.86009999999,537649.38419999997,380834.97470000002,609335.96869999997,425639.0894,681022.55319999997]
[3,"Region III -",null,"PENNSYLVANIA","READING","Detached/Semi-Detached",129358.9618,226378.1832,167996.62299999999,293994.09019999998,200829.84330000001,351452.22570000001,239583.58360000001,419271.27120000002,282750.83549999999,494813.962,310215.82,542877.68500000006,336092.54180000001,588161.94810000004]
[3,"Region III -",null,"PENNSYLVANIA","READING","Row House",108104.7899,189183.38219999999,143944.4431,251902.77540000001,177243.34520000001,310175.8541,222810.70629999999,389918.73609999998,269403.67580000003,471456.4326,297456.11690000002,520548.2047,323719.20669999998,566508.61179999996]
[3,"Region III -",null,"PENNSYLVANIA","READING","Walkup",99529.983200000002,174177.47070000001,137420.28460000001,240485.4981,174217.28330000001,304880.24560000002,227348.2176,397859.38069999998,283159.79989999998,495529.64980000001,318580.95689999999,557516.67449999996,353453.05900000001,618542.85329999996]
[3,"Region III -",null,"PENNSYLVANIA","READING","Elevator",111522.42260000001,178435.87890000001,156131.39170000001,249810.2304,200740.36069999999,321184.58199999999,267653.81430000003,428246.10930000001,334567.26799999998,535307.63659999997,379176.23700000002,606681.98820000002,423785.20600000001,678056.33979999996]
[3,"Region III -",null,"PENNSYLVANIA","SCRANTON","Detached/Semi-Detached",123666.5528,216416.46739999999,160524.47270000001,280917.8273,191828.0454,335699.07939999999,228748.43090000001,400309.75390000001,269895.38280000002,472316.91989999998,296082.76870000002,518144.84529999999,320729.07140000002,561275.875]
[3,"Region III -",null,"PENNSYLVANIA","SCRANTON","Row House",103777.4376,181610.51579999999,138016.92929999999,241529.62640000001,169756.2775,297073.48570000002,213052.71170000001,372842.24530000001,257405.38080000001,450459.41639999999,284142.49670000002,497249.36920000002,309150.35479999997,541013.12080000003]
[3,"Region III -",null,"PENNSYLVANIA","SCRANTON","Walkup",95821.258700000006,167687.2029,132351.48190000001,231615.09330000001,167858.61429999999,293752.57510000002,219187.33619999999,383577.8383,273024.55420000001,477792.97,307244.20199999999,537677.35349999997,340950.05530000001,596662.59680000006]
[3,"Region III -",null,"PENNSYLVANIA","SCRANTON","Elevator",106624.55620000001,170599.29240000001,149274.37849999999,238839.00930000001,191924.20110000001,307078.72619999998,255898.93470000001,409438.30160000001,319873.66840000002,511797.87709999998,362523.49089999998,580037.59400000004,405173.31329999998,648277.31090000004]
[3,"Region III -",null,"PENNSYLVANIA","STATE COLLEGE","Detached/Semi-Detached",121266.2116,212215.8702,157480.15710000001,275590.27490000002,188252.35250000001,329441.61670000001,224571.13260000001,392999.48200000002,265027.91019999998,463798.84289999999,290769.00780000002,508845.76380000002,315019.34039999999,551283.84569999995]
[3,"Region III -",null,"PENNSYLVANIA","STATE COLLEGE","Row House",101376.9964,177409.74359999999,134972.61369999999,236202.07399999999,166180.58470000001,290816.0232,208875.41339999999,365531.97340000002,252537.90820000001,441941.3394,278828.73580000002,487950.28779999999,303440.6238,531021.09160000004]
[3,"Region III -",null,"PENNSYLVANIA","STATE COLLEGE","Walkup",93358.445000000007,163377.2787,128903.5426,225581.19949999999,163425.54949999999,285994.71179999999,213276.58309999999,373234.02049999998,265636.11290000001,464863.19770000002,298870.63510000001,523023.6115,331591.36290000001,580284.88509999996]
[3,"Region III -",null,"PENNSYLVANIA","STATE COLLEGE","Elevator",104546.3259,167274.12409999999,146364.85630000001,234183.77359999999,188183.38680000001,301093.42320000002,250911.18229999999,401457.89760000003,313638.9779,501822.37209999998,355457.50829999999,568732.02170000004,397276.03869999998,635641.67130000005]
[3,"Region III -",null,"PENNSYLVANIA","WILKES-BARRE","Detached/Semi-Detached",120666.1271,211165.7225,156719.07939999999,274258.38880000002,187358.43049999999,327877.25349999999,223526.80960000001,391171.91680000001,263811.04389999999,461669.32679999998,289440.56969999999,506520.99680000002,313591.90970000002,548785.84199999995]
[3,"Region III -",null,"PENNSYLVANIA","WILKES-BARRE","Row House",100776.8869,176359.552,134211.53589999999,234870.18789999999,165286.66269999999,289251.65980000002,207831.09039999999,363704.40820000001,251321.04190000001,439811.82329999999,277500.2977,485625.5208,302013.19309999997,528523.08790000004]
[3,"Region III -",null,"PENNSYLVANIA","WILKES-BARRE","Walkup",92742.742499999993,162299.79930000001,128041.55899999999,224072.72829999999,162317.285,284055.2488,211798.8971,370648.0699,263789.00530000002,461630.75949999999,296777.24650000001,519360.18150000001,329251.69339999999,576190.46329999994]
[3,"Region III -",null,"PENNSYLVANIA","WILKES-BARRE","Elevator",104026.7692,166442.83319999999,145637.47690000001,233019.96650000001,187248.18460000001,299597.09970000002,249664.24600000001,399462.79969999997,312080.3076,499328.49959999998,353691.01520000002,565905.63289999997,395301.72289999999,632482.76619999995]
[3,"Region III -",null,"PENNSYLVANIA","WILLIAMSPORT","Detached/Semi-Detached",118865.8703,208015.27299999999,154435.84150000001,270262.72259999998,184676.65960000001,323184.15419999999,220393.83439999999,385689.21010000003,260160.4376,455280.76579999999,285455.24709999998,499546.68229999999,309309.60930000001,541291.81629999995]
[3,"Region III -",null,"PENNSYLVANIA","WILLIAMSPORT","Row House",98976.554999999993,173208.97140000001,131928.29810000001,230874.52170000001,162604.89180000001,284558.56050000002,204698.1152,358221.70150000002,247670.4356,433423.2623,273514.97509999998,478651.20630000002,297730.89270000003,521029.06219999999]
[3,"Region III -",null,"PENNSYLVANIA","WILLIAMSPORT","Walkup",90895.631299999994,159067.35459999999,125455.6033,219547.3058,158992.48480000001,278236.84830000001,207365.83009999999,362890.20270000002,258247.6716,451933.42540000001,290497.06839999999,508369.86959999998,322232.67060000001,563907.17350000003]
[3,"Region III -",null,"PENNSYLVANIA","WILLIAMSPORT","Elevator",102468.0958,163948.95569999999,143455.33410000001,229528.538,184442.57250000001,295108.1202,245923.42989999999,393477.49369999999,307404.28739999997,491846.86719999998,348391.5257,557426.44940000004,389378.76400000002,623006.03170000005]
[3,"Region III -",null,"PENNSYLVANIA","YORK","Detached/Semi-Detached",121349.5377,212361.69099999999,157657.99720000001,275901.495,188525.6349,329919.86109999998,224981.48430000001,393717.59749999997,265571.80670000002,464750.6618,291391.03289999999,509934.3076,315738.36139999999,552542.13230000006]
[3,"Region III -",null,"PENNSYLVANIA","YORK","Row House",101070.2427,176872.9247,134709.12969999999,235740.97709999999,166021.08780000001,290536.90350000001,208978.0062,365711.51079999999,252836.90289999999,442464.58010000002,279216.63819999999,488629.11680000002,303932.61129999999,531882.06960000005]
[3,"Region III -",null,"PENNSYLVANIA","YORK","Walkup",92834.844200000007,162460.97750000001,128135.24129999999,224236.6721,162392.48699999999,284186.85220000002,211808.49679999999,370664.86940000003,263782.18910000002,461618.8309,296726.70520000003,519271.73420000001,329147.35269999999,576007.86710000003]
[3,"Region III -",null,"PENNSYLVANIA","YORK","Elevator",104609.7114,167375.54070000001,146453.59589999999,234325.75700000001,188297.48050000001,301275.97330000001,251063.30729999999,401701.2977,313829.13419999997,502126.62219999998,355673.01870000002,569076.83849999995,397516.90330000001,636027.05480000004]
[3,"Region III -",null,"VIRGINIA","ALEXANDRIA","Detached/Semi-Detached",128467.2283,224817.64939999999,166613.0949,291572.91609999997,198979.42060000001,348213.98590000003,237103.01490000001,414930.27590000001,279630.31349999999,489353.04859999998,306710.2745,536742.98049999995,332148.51659999997,581259.90390000003]
[3,"Region III -",null,"VIRGINIA","ALEXANDRIA","Row House",108578.31299999999,190012.0478,144105.5515,252184.71520000001,176907.65280000001,309588.39230000001,221407.29560000001,387462.76730000001,267140.31150000001,467495.54509999999,294770.0025,515847.50449999998,320569.79989999998,560997.14969999995]
[3,"Region III -",null,"VIRGINIA","ALEXANDRIA","Walkup",100746.879,176307.03820000001,139247.35019999999,243682.8628,176724.73069999999,309268.27879999997,231008.8247,404265.44329999998,287801.41489999997,503652.47610000003,323991.31069999997,566984.79370000004,359667.41210000002,629417.97109999997]
[3,"Region III -",null,"VIRGINIA","ALEXANDRIA","Elevator",110781.01029999999,177249.61910000001,155093.41440000001,248149.46669999999,199405.81849999999,319049.31439999997,265874.42469999997,425399.0858,332343.03090000001,531748.85730000003,376655.435,602648.70490000001,420967.83909999998,673548.55260000005]
[3,"Region III -",null,"VIRGINIA","ARLINGTON","Detached/Semi-Detached",126708.63800000001,221740.11660000001,164418.78159999999,287732.86780000001,196434.29610000001,343760.01809999999,234175.22169999999,409806.63799999998,276251.66279999999,483440.40980000002,303035.97240000003,530312.95160000003,328225.73509999999,574395.03639999998]
[3,"Region III -",null,"VIRGINIA","ARLINGTON","Row House",106624.6079,186593.06390000001,141690.57620000001,247958.50839999999,174146.13860000001,304755.7426,218325.62299999999,382069.84029999998,263639.20990000002,461368.61729999998,290978.63900000002,509212.61820000003,316533.50170000002,553933.62800000003]
[3,"Region III -",null,"VIRGINIA","ARLINGTON","Walkup",98637.971000000005,172616.44930000001,136277.24890000001,238485.18549999999,172883.40580000001,302545.96010000003,225841.72330000001,395223.0159,281333.13020000001,492332.9779,316639.18,554118.56499999994,351426.3982,614996.19680000003]
[3,"Region III -",null,"VIRGINIA","ARLINGTON","Elevator",109254.0327,174806.45499999999,152955.6458,244729.03690000001,196657.25889999999,314651.6188,262209.67849999998,419535.49170000001,327762.0981,524419.36470000003,371463.71110000001,594341.94669999997,415165.32419999997,664264.52870000002]
[3,"Region III -",null,"VIRGINIA","CHARLOTTESVILLE","Detached/Semi-Detached",115490.48020000001,202108.34039999999,149830.17189999999,262202.80080000003,178977.27830000001,313210.23690000002,213325.63570000001,373319.86239999998,251628.5698,440349.99729999999,276013.9412,483024.39720000001,298936.85979999998,523139.50459999999]
[3,"Region III -",null,"VIRGINIA","CHARLOTTESVILLE","Row House",97356.400500000003,170373.70069999999,129308.5877,226290.02840000001,158853.01879999999,277992.783,199014.83240000001,348275.95689999999,240240.62650000001,420421.09649999999,265127.22240000003,463972.63929999998,288379.79430000001,504664.64]
[3,"Region III -",null,"VIRGINIA","CHARLOTTESVILLE","Walkup",90173.323399999994,157803.31589999999,124603.04399999999,218055.32709999999,158099.94680000001,276674.9069,206583.79259999999,361521.63699999999,257354.79670000001,450370.89429999999,289677.8162,506936.17839999998,321532.3762,562681.65830000001]
[3,"Region III -",null,"VIRGINIA","CHARLOTTESVILLE","Elevator",99585.077300000004,159336.12609999999,139419.10819999999,223070.5765,179253.13920000001,286805.0269,239004.18549999999,382406.70250000001,298755.23190000001,478008.37829999998,338589.26289999997,541742.82860000001,378423.29379999998,605477.27910000004]
[3,"Region III -",null,"VIRGINIA","FREDERICKSBURG","Detached/Semi-Detached",124266.6372,217466.6152,161285.55050000001,282249.71340000001,192721.96720000001,337263.44260000001,229792.75390000001,402137.31920000003,271112.24910000002,474446.43599999999,297411.20699999999,520469.61219999997,322156.50209999998,563773.87860000005]
[3,"Region III -",null,"VIRGINIA","FREDERICKSBURG","Row House",104377.54700000001,182660.70730000001,138778.00709999999,242861.51250000001,170650.19940000001,298637.84909999999,214097.03460000001,374669.81060000003,258622.24720000001,452588.9325,285470.935,499574.1361,310577.7855,543511.12450000003]
[3,"Region III -",null,"VIRGINIA","FREDERICKSBURG","Walkup",96436.961299999995,168764.68229999999,133213.46539999999,233123.56450000001,168966.87890000001,295692.03810000001,220665.02230000001,386163.78899999999,274871.6618,481025.40830000001,309337.5906,541340.78350000002,343289.72489999997,600757.01859999995]
[3,"Region III -",null,"VIRGINIA","FREDERICKSBURG","Elevator",107144.11289999999,171430.58319999999,150001.75810000001,240002.81649999999,192859.40330000001,308575.04969999997,257145.87100000001,411433.3996,321432.33870000002,514291.74959999998,364289.98389999999,582863.98289999994,407147.62900000002,651436.21609999996]
[3,"Region III -",null,"VIRGINIA","LYNCHBURG","Detached/Semi-Detached",116090.5646,203158.48809999999,150591.24969999999,263534.68689999997,179871.20009999999,314774.60019999999,214369.95860000001,375147.4277,252845.4362,442479.5134,277342.37949999998,485349.1642,300364.2904,525637.50820000004]
[3,"Region III -",null,"VIRGINIA","LYNCHBURG","Row House",97956.509900000005,171423.8922,130069.6655,227621.91450000001,159746.94080000001,279557.14630000002,200059.15539999999,350103.5221,241457.49290000001,422550.61259999999,266455.6606,466297.40610000002,289807.22499999998,507162.64360000001]
[3,"Region III -",null,"VIRGINIA","LYNCHBURG","Walkup",90789.025899999993,158880.7953,125465.0276,219563.79829999999,159208.2113,278614.36989999999,208061.47870000001,364107.58769999997,259201.90419999999,453603.33250000002,291771.20480000001,510599.60840000003,323872.04570000002,566776.08010000002]
[3,"Region III -",null,"VIRGINIA","LYNCHBURG","Elevator",100104.6341,160167.41699999999,140146.4877,224234.38370000001,180188.3414,288301.3505,240251.12179999999,384401.80060000002,300313.90230000002,480502.25079999998,340355.75589999999,544569.21750000003,380397.60950000002,608636.18429999996]
[3,"Region III -",null,"VIRGINIA","NEWPORT NEWS","Detached/Semi-Detached",121699.64720000001,212974.38269999999,157885.55929999999,276299.72879999998,188599.71479999999,330049.50089999998,224794.7585,393390.82740000001,265156.99070000002,464024.73369999998,290853.40389999998,508993.45689999999,315008.7377,551265.29090000002]
[3,"Region III -",null,"VIRGINIA","NEWPORT NEWS","Row House",102590.6167,179533.57930000001,136260.66390000001,238456.1617,167393.50570000001,292938.63500000001,209714.55720000001,367000.47499999998,253156.7922,443024.38630000001,279381.3775,488917.4105,303884.08789999998,531797.15379999997]
[3,"Region III -",null,"VIRGINIA","NEWPORT NEWS","Walkup",95021.352599999998,166287.3671,131302.13399999999,229778.73449999999,166599.94589999999,291549.90539999999,217690.45069999999,380958.28869999998,271191.07929999998,474584.38880000002,305251.8959,534190.81799999997,338819.06709999999,592933.36730000004]
[3,"Region III -",null,"VIRGINIA","NEWPORT NEWS","Elevator",104939.11500000001,167902.5865,146914.76089999999,235063.62100000001,188890.40700000001,302224.6556,251853.87590000001,402966.20740000001,314817.34490000003,503707.75939999998,356792.99089999998,570868.79390000005,398768.63689999998,638029.82849999995]
[3,"Region III -",null,"VIRGINIA","NORFOLK","Detached/Semi-Detached",120416.14840000001,210728.2597,156185.55859999999,273324.72769999999,186538.58240000001,326442.51919999998,222295.75339999999,389017.56849999999,262179.35269999999,458813.86709999997,287574.4926,503255.36200000002,311434.84480000002,545010.97829999996]
[3,"Region III -",null,"VIRGINIA","NORFOLK","Row House",101697.1489,177970.01060000001,135001.98850000001,236253.47990000001,165765.15400000001,290089.01949999999,207523.3118,363165.79570000002,250424.05669999999,438242.09909999999,276336.58960000001,483589.0318,300537.2292,525940.15099999995]
[3,"Region III -",null,"VIRGINIA","NORFOLK","Walkup",94313.546100000007,165048.7058,130346.46550000001,228106.31450000001,165416.47589999999,289478.83279999997,216203.16039999999,378355.5307,269350.78259999998,471363.86940000003,303209.04259999999,530615.82460000005,336583.73149999999,589021.53009999997]
[3,"Region III -",null,"VIRGINIA","NORFOLK","Elevator",103836.6127,166138.58290000001,145371.25779999999,232594.016,186905.90289999999,299049.44900000002,249207.87049999999,398732.59869999997,311509.8382,498415.74849999999,353044.48320000002,564871.18149999995,394579.12829999998,631326.61470000003]
[3,"Region III -",null,"VIRGINIA","PETERSBURG","Detached/Semi-Detached",119899.3904,209823.9332,155602.32139999999,272304.0625,185917.94380000001,325356.40159999998,221661.78330000001,387908.12079999998,261506.38449999999,457636.1728,286868.08130000002,502019.14230000001,310726.43719999999,543771.26509999996]
[3,"Region III -",null,"VIRGINIA","PETERSBURG","Row House",100790.28479999999,176382.99849999999,133977.42600000001,234460.49549999999,164711.7347,288245.53570000001,206581.58189999999,361517.7683,249506.18599999999,436635.82539999997,275396.05489999999,481943.09590000001,299601.78749999998,524303.12809999997]
[3,"Region III -",null,"VIRGINIA","PETERSBURG","Walkup",93174.241299999994,163054.92240000001,128716.17819999999,225253.31200000001,163275.14559999999,285731.5049,213257.38370000001,373200.42139999999,265649.74550000002,464887.05479999998,298971.71779999998,523200.50599999999,331800.04430000001,580650.07759999996]
[3,"Region III -",null,"VIRGINIA","PETERSBURG","Elevator",103380.44160000001,165408.709,144732.6182,231572.19260000001,186084.7948,297735.67609999998,248113.05970000001,396980.90149999998,310141.3247,496226.12689999997,351493.5013,562389.61049999995,392845.67790000001,628553.09400000004]
[3,"Region III -",null,"VIRGINIA","PORTSMOUTH","Detached/Semi-Detached",116815.63830000001,204427.367,151619.08749999999,265333.4031,181175.04569999999,317056.33,216029.80910000001,378052.16600000003,254878.14739999999,446036.75780000002,279603.8554,489306.74670000002,302870.2525,530022.94169999997]
[3,"Region III -",null,"VIRGINIA","PORTSMOUTH","Row House",98096.488800000006,171668.8553,130435.51730000001,228262.15530000001,160401.61730000001,280702.83020000003,201257.3676,352200.3933,243122.85140000001,425464.98989999999,268365.9523,469640.41649999999,291972.63679999998,510952.11440000002]
[3,"Region III -",null,"VIRGINIA","PORTSMOUTH","Walkup",90619.327300000004,158583.82279999999,125174.55899999999,219055.47839999999,158766.88200000001,277842.04350000003,207337.03520000001,362839.81160000002,258268.12599999999,451969.2206,290648.6985,508635.22259999998,322545.69990000001,564454.97490000003]
[3,"Region III -",null,"VIRGINIA","PORTSMOUTH","Elevator",100719.269,161150.83290000001,141006.97659999999,225611.16589999999,181294.68410000001,290071.49900000001,241726.24559999999,386761.9987,302157.80699999997,483452.49849999999,342445.51459999999,547912.83149999997,382733.22210000001,612373.16469999996]
[3,"Region III -",null,"VIRGINIA","RICHMOND","Detached/Semi-Detached",124266.6372,217466.6152,161285.55050000001,282249.71340000001,192721.96720000001,337263.44260000001,229792.75390000001,402137.31920000003,271112.24910000002,474446.43599999999,297411.20699999999,520469.61219999997,322156.50209999998,563773.87860000005]
[3,"Region III -",null,"VIRGINIA","RICHMOND","Row House",104377.54700000001,182660.70730000001,138778.00709999999,242861.51250000001,170650.19940000001,298637.84909999999,214097.03460000001,374669.81060000003,258622.24720000001,452588.9325,285470.935,499574.1361,310577.7855,543511.12450000003]
[3,"Region III -",null,"VIRGINIA","RICHMOND","Walkup",96436.961299999995,168764.68229999999,133213.46539999999,233123.56450000001,168966.87890000001,295692.03810000001,220665.02230000001,386163.78899999999,274871.6618,481025.40830000001,309337.5906,541340.78350000002,343289.72489999997,600757.01859999995]
[3,"Region III -",null,"VIRGINIA","RICHMOND","Elevator",107144.11289999999,171430.58319999999,150001.75810000001,240002.81649999999,192859.40330000001,308575.04969999997,257145.87100000001,411433.3996,321432.33870000002,514291.74959999998,364289.98389999999,582863.98289999994,407147.62900000002,651436.21609999996]
[3,"Region III -",null,"VIRGINIA","ROANOKE","Detached/Semi-Detached",121057.89969999999,211851.32449999999,157035.56150000001,274812.23269999999,187569.15169999999,328246.01539999997,223545.2597,391204.20449999999,263668.17609999998,461419.30810000002,289213.95319999999,506124.41800000001,313221.7966,548138.14399999997]
[3,"Region III -",null,"VIRGINIA","ROANOKE","Row House",102143.8841,178751.7972,135631.32810000001,237354.8241,166579.33230000001,291513.83140000002,208618.93780000001,365083.141,251790.42860000001,440633.2499,277858.98810000002,486253.2291,302210.66350000002,528868.66110000003]
[3,"Region III -",null,"VIRGINIA","ROANOKE","Walkup",94667.450500000006,165668.03829999999,130824.3011,228942.527,166008.2127,290514.37219999998,216946.80780000001,379656.91360000003,270270.93369999999,472974.13390000002,304230.47230000002,532403.32660000003,337701.40259999997,590977.45460000006]
[3,"Region III -",null,"VIRGINIA","ROANOKE","Elevator",104387.8654,167020.58730000001,146143.0117,233828.82209999999,187898.15779999999,300637.05699999997,250530.87710000001,400849.4094,313163.59649999999,501061.76179999998,354918.7426,567869.99659999995,396673.88880000002,634678.23160000006]
[3,"Region III -",null,"VIRGINIA","WINCHESTER","Detached/Semi-Detached",121782.96980000001,213120.1972,158063.39480000001,276610.94099999999,188872.99189999999,330527.73580000002,225205.10389999999,394108.93190000003,265700.88,464976.54,291475.42109999998,510081.98680000001,315727.7501,552523.56259999995]
[3,"Region III -",null,"VIRGINIA","WINCHESTER","Row House",102283.8594,178996.75399999999,135997.17540000001,237995.0569,167234.00349999999,292659.5061,209817.14369999999,367180.00140000001,253455.77970000001,443547.61450000003,279769.27179999999,489596.22570000001,304376.06689999998,532658.11699999997]
[3,"Region III -",null,"VIRGINIA","WINCHESTER","Walkup",94497.748300000007,165371.0594,130533.8275,228434.19820000001,165566.87669999999,289742.03419999999,216222.35560000001,378389.12219999998,269337.14449999999,471340.00270000001,303107.95360000001,530438.91890000005,336375.0429,588656.32499999995]
[3,"Region III -",null,"VIRGINIA","WINCHESTER","Elevator",105002.4973,168003.99830000001,147003.49619999999,235205.5975,189004.4952,302407.19669999997,252005.99350000001,403209.5956,315007.49190000002,504011.99459999998,357008.49080000003,571213.59380000003,399009.48979999998,638415.19310000003]
[3,"Region III -",null,"WEST VIRGINIA","BECKLEY","Detached/Semi-Detached",120182.10739999999,210318.68799999999,156179.20430000001,273313.60749999998,186790.36550000001,326883.13959999999,222956.58189999999,390174.0184,263214.02669999999,460624.54670000001,288817.79399999999,505431.13939999999,312974.66190000001,547705.65839999996]
[3,"Region III -",null,"WEST VIRGINIA","BECKLEY","Row House",99892.812699999995,174812.4222,133219.07870000001,233133.38759999999,164274.77799999999,287480.8616,206945.25279999999,362154.1924,250472.87539999999,438327.5319,276637.42670000001,484115.49660000001,301163.1201,527035.46030000004]
[3,"Region III -",null,"WEST VIRGINIA","BECKLEY","Walkup",91621.491800000003,160337.61060000001,126435.6482,221262.38440000001,160206.14180000001,280360.74790000002,208891.05679999999,365559.34950000001,260134.90900000001,455236.09090000001,292592.02899999998,512036.05070000002,324525.0232,567918.7905]
[3,"Region III -",null,"WEST VIRGINIA","BECKLEY","Elevator",103598.7197,165757.9541,145038.20759999999,232061.13560000001,186477.6955,298364.31719999999,248636.92730000001,397819.08960000001,310796.15919999999,497273.86200000002,352235.647,563577.04359999998,393675.1349,629880.22519999999]
[3,"Region III -",null,"WEST VIRGINIA","BLUEFIELD","Detached/Semi-Detached",121478.69929999999,212587.72390000001,157896.54680000001,276318.95679999999,188872.52359999999,330526.91629999998,225481.07949999999,394591.88919999998,266222.03989999997,465888.56969999999,292130.15360000002,511227.76870000002,316585.0123,554023.77150000003]
[3,"Region III -",null,"WEST VIRGINIA","BLUEFIELD","Row House",100795.39479999999,176391.94089999999,134490.59390000001,235358.5392,165919.74069999999,290359.54619999998,209158.8512,366027.98940000002,253233.4878,443158.60369999998,279713.2745,489498.2304,304544.12040000001,532952.21070000005]
[3,"Region III -",null,"WEST VIRGINIA","BLUEFIELD","Walkup",92336.518599999996,161588.90760000001,127401.0656,222951.86489999999,161401.6844,282452.94760000001,210393.5191,368188.65830000001,261993.97880000001,458489.46299999999,294655.72169999999,515647.51289999997,326783.16149999999,571870.53260000004]
[3,"Region III -",null,"WEST VIRGINIA","BLUEFIELD","Elevator",104712.46859999999,167539.95240000001,146597.45610000001,234555.9333,188482.4436,301571.9142,251309.92480000001,402095.88569999998,314137.40590000001,502619.85700000002,356022.3934,569635.83790000004,397907.38089999999,636651.81889999995]
[3,"Region III -",null,"WEST VIRGINIA","CHARLESTON","Detached/Semi-Detached",124430.9135,217754.0986,161604.34659999999,282807.6066,193194.98130000001,338091.21710000001,230484.77489999999,403348.35619999998,272019.23849999998,476033.66739999998,298444.61109999998,522278.06939999998,323344.42940000002,565852.75159999996]
[3,"Region III -",null,"WEST VIRGINIA","CHARLESTON","Row House",103944.76390000001,181903.33679999999,138421.30739999999,242237.2879,170460.79610000001,298306.39319999999,214317.99619999999,375056.49339999998,259154.38690000001,453520.17700000003,286145.98790000001,500755.47889999999,311418.21260000003,544981.87210000004]
[3,"Region III -",null,"WEST VIRGINIA","CHARLESTON","Walkup",95673.224000000002,167428.14199999999,132090.26329999999,231157.9607,167453.50690000001,293043.63709999999,218508.41320000001,382389.723,272147.1005,476257.42570000002,306184.2194,535822.38379999995,339692.1238,594461.21680000005]
[3,"Region III -",null,"WEST VIRGINIA","CHARLESTON","Elevator",107272.9379,171636.70319999999,150182.11309999999,240291.38449999999,193091.28820000001,308946.06569999998,257455.05100000001,411928.08769999997,321818.8137,514910.10950000002,364727.98879999999,583564.79079999996,407637.16399999999,652219.47210000001]
[3,"Region III -",null,"WEST VIRGINIA","CLARKSBURG","Detached/Semi-Detached",120182.10739999999,210318.68799999999,156179.20430000001,273313.60749999998,186790.36550000001,326883.13959999999,222956.58189999999,390174.0184,263214.02669999999,460624.54670000001,288817.79399999999,505431.13939999999,312974.66190000001,547705.65839999996]
[3,"Region III -",null,"WEST VIRGINIA","CLARKSBURG","Row House",99892.812699999995,174812.4222,133219.07870000001,233133.38759999999,164274.77799999999,287480.8616,206945.25279999999,362154.1924,250472.87539999999,438327.5319,276637.42670000001,484115.49660000001,301163.1201,527035.46030000004]
[3,"Region III -",null,"WEST VIRGINIA","CLARKSBURG","Walkup",91621.491800000003,160337.61060000001,126435.6482,221262.38440000001,160206.14180000001,280360.74790000002,208891.05679999999,365559.34950000001,260134.90900000001,455236.09090000001,292592.02899999998,512036.05070000002,324525.0232,567918.7905]
[3,"Region III -",null,"WEST VIRGINIA","CLARKSBURG","Elevator",103598.7197,165757.9541,145038.20759999999,232061.13560000001,186477.6955,298364.31719999999,248636.92730000001,397819.08960000001,310796.15919999999,497273.86200000002,352235.647,563577.04359999998,393675.1349,629880.22519999999]
[3,"Region III -",null,"WEST VIRGINIA","HUNTINGTON","Detached/Semi-Detached",122486.0257,214350.54500000001,159028.33300000001,278299.58270000003,190071.74410000001,332625.55209999997,226698.02849999999,396721.55,267507.21879999997,468137.63280000002,293476.07160000002,513583.12520000001,317928.90389999998,556375.58180000004]
[3,"Region III -",null,"WEST VIRGINIA","HUNTINGTON","Row House",102590.8907,179534.05859999999,136514.03460000001,238899.56049999999,167993.35209999999,293988.36619999999,210997.5987,369245.7978,255013.46830000001,446273.56949999998,281532.21610000002,492681.37809999997,306346.71220000001,536106.74639999995]
[3,"Region III -",null,"WEST VIRGINIA","HUNTINGTON","Walkup",94600.683699999994,165551.1966,130642.1372,228623.7401,165660.19289999999,289905.33760000003,216254.71979999999,378445.7598,269358.49579999998,471377.3677,303088.68030000001,530405.19059999997,336304.91629999998,588533.60360000003]
[3,"Region III -",null,"WEST VIRGINIA","HUNTINGTON","Elevator",105602.31449999999,168963.70569999999,147843.2403,236549.18789999999,190084.166,304134.67019999999,253445.55480000001,405512.89360000001,316806.94349999999,506891.11700000003,359047.86920000002,574476.59920000006,401288.79499999998,642062.08149999997]
[3,"Region III -",null,"WEST VIRGINIA","MORGANTOWN","Detached/Semi-Detached",120782.19190000001,211368.8357,156940.28210000001,274645.49359999999,187684.2873,328447.50290000002,224000.90489999999,392001.58360000001,264430.89309999999,462754.06280000001,290146.23210000002,507755.90620000003,314402.09259999997,550203.66200000001]
[3,"Region III -",null,"WEST VIRGINIA","MORGANTOWN","Row House",100492.9221,175862.61369999999,133980.15640000001,234465.27369999999,165168.70000000001,289045.22499999998,207989.57579999999,363981.75770000002,251689.74170000001,440457.04800000001,277965.86489999999,486440.2635,302590.55080000003,529533.46389999997]
[3,"Region III -",null,"WEST VIRGINIA","MORGANTOWN","Walkup",92237.194300000003,161415.09,127297.6318,222770.85560000001,161314.4062,282300.21090000001,210368.74290000001,368145.30009999999,261982.01670000001,458468.52919999999,294685.41759999999,515699.48080000002,326864.69270000001,572013.21230000001]
[3,"Region III -",null,"WEST VIRGINIA","MORGANTOWN","Elevator",104118.27650000001,166589.24479999999,145765.5871,233224.94279999999,187412.8976,299860.64069999999,249883.86360000001,399814.1876,312354.82949999999,499767.73450000002,354002.14,566403.4325,395649.45059999998,633039.13040000002]
[3,"Region III -",null,"WEST VIRGINIA","PARKERSBURG","Detached/Semi-Detached",120085.68799999999,210149.9541,155984.02179999999,272972.03830000001,186496.05650000001,326368.09879999998,222520.7365,389411.28899999999,262639.75349999999,459619.56849999999,288162.3186,504284.0576,312219.1814,546383.56740000006]
[3,"Region III -",null,"WEST VIRGINIA","PARKERSBURG","Row House",100190.45299999999,175333.29269999999,133469.72349999999,233572.01620000001,164417.66450000001,287730.9129,206820.30669999999,361935.5368,250146.00289999999,437755.50510000001,276218.4632,483382.31040000002,300636.98969999998,526114.73199999996]
[3,"Region III -",null,"WEST VIRGINIA","PARKERSBURG","Walkup",92137.873600000006,161241.2789,127194.20299999999,222589.8553,161227.1347,282147.48580000002,210343.97560000001,368101.95730000001,261970.0655,458447.61469999998,294715.12599999999,515751.4705,326946.23790000001,572155.91639999999]
[3,"Region III -",null,"WEST VIRGINIA","PARKERSBURG","Elevator",103524.0874,165638.5423,144933.72229999999,231893.95920000001,186343.3573,298149.3762,248457.80970000001,397532.50150000001,310572.2622,496915.62689999997,351981.8971,563171.04379999998,393391.53210000001,629426.46070000005]
[3,"Region III -",null,"WEST VIRGINIA","WHEELING","Detached/Semi-Detached",120733.98390000001,211284.47200000001,156842.6931,274474.71299999999,187537.1355,328189.98719999997,223782.98540000001,391620.2243,264143.76,462251.58,289818.49849999999,507182.37229999999,314024.3566,549542.62399999995]
[3,"Region III -",null,"WEST VIRGINIA","WHEELING","Row House",100641.74400000001,176123.052,134105.4811,234684.592,165240.1459,289170.25520000001,207927.1059,363872.43530000001,251526.30910000001,440171.04090000002,277756.38709999999,486073.67739999999,302327.48989999999,529073.10719999997]
[3,"Region III -",null,"WEST VIRGINIA","WHEELING","Walkup",92495.387100000007,161866.92739999999,127676.9117,223434.5955,161824.90609999999,283193.5857,211095.20670000001,369416.61170000001,262899.6004,460074.30060000002,295746.97230000002,517557.20159999997,328075.30709999998,574131.78740000003]
[3,"Region III -",null,"WEST VIRGINIA","WHEELING","Elevator",104080.96189999999,166529.54149999999,145713.34659999999,233141.35810000001,187345.73130000001,299753.17469999997,249794.30850000001,399670.8995,312242.88559999998,499588.62439999997,353875.27039999998,566200.44099999999,395507.65509999997,632812.25760000001]
[4,"Region IV - Southeast",null,"ALABAMA","ANNISTON","Detached/Semi-Detached",97467.243900000001,170567.67679999999,126396.887,221194.55220000001,150940.86739999999,264146.51809999999,179846.67189999999,314731.67570000002,212094.57819999999,371165.51189999998,232630.0925,407102.66190000001,251916.79550000001,440854.3921]
[4,"Region IV - Southeast",null,"ALABAMA","ANNISTON","Row House",82439.151400000002,144268.51500000001,109390.13649999999,191432.739,134263.39009999999,234960.93280000001,167986.95120000001,293977.16450000001,202657.10459999999,354649.93310000002,223607.99609999999,391313.99329999997,243167.89110000001,425543.80949999997]
[4,"Region IV - Southeast",null,"ALABAMA","ANNISTON","Walkup",76532.021299999993,133931.03719999999,105786.0451,185125.57889999999,134267.01930000001,234967.2838,175528.6746,307175.18050000002,218685.75520000001,382700.07160000002,246193.90299999999,430839.33039999998,273313.82669999998,478299.19679999998]
[4,"Region IV - Southeast",null,"ALABAMA","ANNISTON","Elevator",84050.2071,134480.3334,117670.29,188272.46669999999,151290.37280000001,242064.60010000001,201720.49710000001,322752.80009999999,252150.6213,403441.0001,285770.70419999998,457233.1335,319390.78700000001,511025.26689999999]
[4,"Region IV - Southeast",null,"ALABAMA","BIRMINGHAM","Detached/Semi-Detached",104643.208,183125.6139,135699.06479999999,237473.36350000001,162046.11869999999,283580.70779999997,193074.11660000001,337879.70409999997,227690.61610000001,398458.57809999998,249734.82180000001,437035.93800000002,270437.21250000002,473265.12190000003]
[4,"Region IV - Southeast",null,"ALABAMA","BIRMINGHAM","Row House",88528.752699999997,154925.31719999999,117462.91069999999,205560.09390000001,144163.04060000001,252285.321,180357.06659999999,315624.86660000001,217570.9155,380749.10190000001,240060.52559999999,420105.91989999998,261055.8573,456847.7501]
[4,"Region IV - Southeast",null,"ALABAMA","BIRMINGHAM","Walkup",82197.982699999993,143846.46969999999,113620.1657,198835.29,144213.416,252373.478,188537.95730000001,329941.4252,234894.94260000001,411066.1495,264445.0417,462778.82280000002,293578.85220000002,513762.99129999999]
[4,"Region IV - Southeast",null,"ALABAMA","BIRMINGHAM","Elevator",90238.801000000007,144382.08379999999,126334.3214,202134.91740000001,162429.84179999999,259887.75080000001,216573.12239999999,346517.00109999999,270716.4031,433146.25140000001,306811.92349999998,490899.08490000002,342907.44390000001,548651.91839999997]
[4,"Region IV - Southeast",null,"ALABAMA","DOTHAN","Detached/Semi-Detached",105830.85219999999,185203.9915,137305.84280000001,240285.2249,164023.0569,287040.34970000002,195510.54730000001,342143.45770000003,230621.17009999999,403587.0477,252973.43410000001,442703.50959999999,273987.69919999997,479478.47360000003]
[4,"Region IV - Southeast",null,"ALABAMA","DOTHAN","Row House",89173.115099999995,156052.95139999999,118454.9863,207296.22589999999,145537.1778,254690.06109999999,182364.83230000001,319138.45640000002,220160.35569999999,385280.62239999999,242973.03769999999,425202.81599999999,264290.11810000002,462507.70669999998]
[4,"Region IV - Southeast",null,"ALABAMA","DOTHAN","Walkup",82568.152400000006,144494.26689999999,114089.29059999999,199656.25870000001,144753.5545,253318.72039999999,189131.85200000001,330980.74099999998,235611.103,412319.4301,265197.05310000002,464094.8431,294352.6826,515117.19459999999]
[4,"Region IV - Southeast",null,"ALABAMA","DOTHAN","Elevator",91254.870899999994,146007.79560000001,127756.8193,204410.91390000001,164258.76759999999,262814.03210000001,219011.69010000001,350418.70939999999,273764.6127,438023.38679999998,310266.56099999999,496426.505,346768.50939999998,554829.62320000003]
[4,"Region IV - Southeast",null,"ALABAMA","GADSDEN","Detached/Semi-Detached",99259.148700000005,173703.51010000001,128736.5367,225288.9393,153748.69810000001,269060.22159999999,183211.49969999999,320620.12430000002,216076.39430000001,378133.6899,237003.2341,414755.65970000002,256662.84090000001,449159.97159999999]
[4,"Region IV - Southeast",null,"ALABAMA","GADSDEN","Row House",83868.909499999994,146770.59169999999,111319.9843,194809.97260000001,136669.353,239171.3677,171066.00200000001,299365.50339999999,206411.51120000001,361220.1446,227763.73740000001,398586.5404,247703.11919999999,433480.45860000001]
[4,"Region IV - Southeast",null,"ALABAMA","GADSDEN","Walkup",77804.972599999994,136158.70209999999,107535.43520000001,188187.01149999999,136474.22029999999,238829.8855,178387.41589999999,312177.97779999999,222241.70989999999,388922.99219999998,250184.22700000001,437822.3971,277729.16509999998,486026.03889999999]
[4,"Region IV - Southeast",null,"ALABAMA","GADSDEN","Elevator",85593.516000000003,136949.62770000001,119830.92230000001,191729.47870000001,154068.32870000001,246509.3297,205424.43840000001,328679.10629999998,256780.54790000001,410848.88280000002,291017.95429999998,465628.73389999999,325255.36070000002,520408.58490000002]
[4,"Region IV - Southeast",null,"ALABAMA","HUNTSVILLE","Detached/Semi-Detached",107026.84510000001,187296.97889999999,138856.20430000001,242998.35750000001,165873.93040000001,290279.37809999997,197715.11919999999,346001.45860000001,233220.50719999999,408135.88750000001,255824.21950000001,447692.38390000002,277074.43229999999,484880.25650000002]
[4,"Region IV - Southeast",null,"ALABAMA","HUNTSVILLE","Row House",90188.047600000005,157829.0834,119800.4473,209650.78279999999,147187.11790000001,257577.45619999999,184426.51620000001,322746.4032,222645.9883,389630.47940000001,245715.12330000001,430001.4657,267271.44280000002,467725.02500000002]
[4,"Region IV - Southeast",null,"ALABAMA","HUNTSVILLE","Walkup",83512.478400000007,146146.83730000001,115394.9761,201941.20819999999,146411.28570000001,256219.7499,191300.06359999999,334775.11129999999,238312.63149999999,417047.10509999999,268238.90659999999,469418.08649999998,297730.18349999998,521027.8211]
[4,"Region IV - Southeast",null,"ALABAMA","HUNTSVILLE","Elevator",92286.302200000006,147658.0857,129200.82309999999,206721.32,166115.34400000001,265784.55420000001,221487.12520000001,354379.4057,276858.90659999999,442974.25709999999,313773.42739999999,502037.4914,350687.94829999999,561100.72569999995]
[4,"Region IV - Southeast",null,"ALABAMA","MOBILE","Detached/Semi-Detached",105226.5882,184146.5295,136572.9664,239002.6912,163192.1594,285586.27889999998,194582.144,340518.75199999998,229569.90090000001,401747.32650000002,251838.89679999999,440718.06939999998,272792.13189999998,477386.23080000002]
[4,"Region IV - Southeast",null,"ALABAMA","MOBILE","Row House",88387.715800000005,154678.50270000001,117517.20940000001,205655.1165,144505.3469,252884.35699999999,181293.54089999999,317263.69660000002,218995.38200000001,383241.91850000003,241729.80059999999,423027.15110000002,262989.14240000001,460230.99930000002]
[4,"Region IV - Southeast",null,"ALABAMA","MOBILE","Walkup",81665.367199999993,142914.39259999999,112809.02039999999,197415.78570000001,143086.48540000001,250401.34950000001,186866.99660000001,327017.24400000001,232771.2977,407349.77100000001,261958.72829999999,458427.7746,290711.16070000001,508744.53129999997]
[4,"Region IV - Southeast",null,"ALABAMA","MOBILE","Elevator",90727.628800000006,145164.20819999999,127018.68030000001,203229.8915,163309.73180000001,261295.5748,217746.30910000001,348394.09970000002,272182.88630000001,435492.62469999999,308473.93780000001,493558.30790000001,344764.98930000002,551623.99120000005]
[4,"Region IV - Southeast",null,"ALABAMA","MONTGOMERY","Detached/Semi-Detached",105234.9439,184161.15179999999,136516.55910000001,238903.9785,163066.10550000001,285365.68459999998,194350.2984,340113.0221,229238.69940000001,401167.72399999999,251451.08689999999,440039.402,272328.39669999998,476574.69429999997]
[4,"Region IV - Southeast",null,"ALABAMA","MONTGOMERY","Row House",88758.292000000001,155327.011,117870.603,206273.55530000001,144781.15960000001,253367.02919999999,181347.47150000001,317358.07490000001,218891.58929999999,383060.28120000003,241559.3904,422728.93329999998,262736.22409999999,459788.3921]
[4,"Region IV - Southeast",null,"ALABAMA","MONTGOMERY","Walkup",82239.528999999995,143919.1758,113645.58869999999,198879.78030000001,144204.08790000001,252357.1539,188441.32639999999,329772.32120000001,234756.682,410824.19349999999,264248.5883,462435.02960000001,293314.85139999999,513300.98979999998]
[4,"Region IV - Southeast",null,"ALABAMA","MONTGOMERY","Elevator",90742.996400000004,145188.79629999999,127040.1949,203264.3149,163337.39350000001,261339.8334,217783.19130000001,348453.11119999998,272228.98910000001,435566.38900000002,308526.1876,493641.90749999997,344823.3861,551717.42610000004]
[4,"Region IV - Southeast",null,"ALABAMA","PHENIX CITY","Detached/Semi-Detached",98667.412800000006,172667.97229999999,127919.0425,223858.32440000001,152728.71119999999,267275.24469999998,181935.31789999999,318386.8063,214528.31090000001,375424.5441,235286.96900000001,411752.19569999998,254771.65669999999,445850.39929999999]
[4,"Region IV - Southeast",null,"ALABAMA","PHENIX CITY","Row House",83639.370299999995,146368.89799999999,110912.29210000001,194096.51120000001,136051.23389999999,238089.6594,170075.59719999999,297632.29509999999,205090.83730000001,358908.96529999998,226264.8726,395963.52710000001,246022.7524,430539.81660000002]
[4,"Region IV - Southeast",null,"ALABAMA","PHENIX CITY","Walkup",77763.426300000006,136085.99600000001,107510.01210000001,188142.52129999999,136483.5484,238846.20970000001,178484.04670000001,312347.08169999998,222379.97029999999,389164.94819999998,250380.68030000001,438166.19040000002,277993.16590000002,486488.0404]
[4,"Region IV - Southeast",null,"ALABAMA","PHENIX CITY","Elevator",85089.320600000006,136142.91510000001,119125.04889999999,190600.08110000001,153160.77720000001,245057.24710000001,204214.36960000001,326742.99619999999,255267.96189999999,408428.7452,289303.69020000001,462885.91119999997,323339.41840000002,517343.0772]
[4,"Region IV - Southeast",null,"ALABAMA","TUSCALOOSA","Detached/Semi-Detached",100467.66959999999,175818.42180000001,130202.2804,227853.99059999999,155410.4823,271968.34399999998,185068.29319999999,323869.51289999997,218178.91709999999,381813.10499999998,239272.29149999999,418726.51020000002,259053.9572,453344.42499999999]
[4,"Region IV - Southeast",null,"ALABAMA","TUSCALOOSA","Row House",85439.702099999995,149519.47870000001,113195.52989999999,198092.17739999999,138733.005,242782.75870000001,173208.57250000001,303115.00170000002,208741.44349999999,365297.52620000002,230250.19519999999,402937.84169999999,250305.0528,438033.84240000002]
[4,"Region IV - Southeast",null,"ALABAMA","TUSCALOOSA","Walkup",79610.537500000006,139318.44080000001,110095.9679,192667.94390000001,139808.3486,244664.61009999999,182917.11369999999,320104.94890000002,227921.30410000001,398862.28220000002,256660.8584,449156.5024,285012.1887,498771.33010000002]
[4,"Region IV - Southeast",null,"ALABAMA","TUSCALOOSA","Elevator",86647.994000000006,138636.79259999999,121307.19160000001,194091.50949999999,155966.38930000001,249546.22659999999,207955.1857,332728.30209999997,259943.98209999999,415910.37760000001,294603.17979999998,471365.09460000001,329262.3774,526819.81169999996]
[4,"Region IV - Southeast",null,"FLORIDA","DAYTONA BEACH","Detached/Semi-Detached",109447.9657,191533.94010000001,142130.465,248728.31390000001,169901.4074,297327.46299999999,202677.21729999999,354685.13040000002,239187.9437,418578.90149999998,262418.5306,459232.42859999998,284303.02590000001,497530.2953]
[4,"Region IV - Southeast",null,"FLORIDA","DAYTONA BEACH","Row House",91508.675799999997,160140.18280000001,121829.5428,213201.69990000001,149993.53769999999,262488.69099999999,188520.29370000001,329910.51390000002,227922.45129999999,398864.28970000002,251648.8731,440385.52799999999,273859.47710000002,479254.08500000002]
[4,"Region IV - Southeast",null,"FLORIDA","DAYTONA BEACH","Walkup",84278.091100000005,147486.65950000001,116367.34910000001,203642.861,147533.81950000001,258184.18400000001,192540.95749999999,336946.67560000002,239810.66080000001,419668.65649999998,269815.87030000001,472177.77309999999,299357.65740000003,523875.90049999999]
[4,"Region IV - Southeast",null,"FLORIDA","DAYTONA BEACH","Elevator",94357.810700000002,150972.4994,132100.935,211361.49919999999,169844.05929999999,271750.49890000001,226458.7458,362333.99859999999,283073.43219999998,452917.49819999997,320816.5564,513306.49790000002,358559.68070000003,573695.49769999995]
[4,"Region IV - Southeast",null,"FLORIDA","FORT MYERS","Detached/Semi-Detached",107689.37549999999,188456.40719999999,139936.15169999999,244888.26560000001,167356.28289999999,292873.4951,199749.42420000001,349561.49229999998,235809.29300000001,412666.26270000002,258744.22839999999,452802.39980000001,280380.24440000003,490665.4278]
[4,"Region IV - Southeast",null,"FLORIDA","FORT MYERS","Row House",89554.970700000005,156721.19880000001,119414.56759999999,208975.4932,147232.02359999999,257656.04130000001,185438.62100000001,324517.58679999999,224421.34959999999,392737.36190000002,247857.50959999999,433750.64179999998,269823.179,472190.56329999998]
[4,"Region IV - Southeast",null,"FLORIDA","FORT MYERS","Walkup",82169.183099999995,143796.07060000001,113397.2478,198445.18369999999,143692.4945,251461.86540000001,187373.85620000001,327904.24829999998,233342.37609999999,408349.15830000001,262463.73969999998,459311.54430000001,291116.64350000001,509454.1262]
[4,"Region IV - Southeast",null,"FLORIDA","FORT MYERS","Elevator",92830.833199999994,148529.33530000001,129963.1664,207941.0693,167095.49960000001,267352.80339999998,222793.99950000001,356470.4045,278492.49939999997,445588.00569999998,315624.83260000002,504999.73969999998,352757.16590000002,564411.47380000004]
[4,"Region IV - Southeast",null,"FLORIDA","GAINESVILLE","Detached/Semi-Detached",108847.88129999999,190483.7923,141369.3872,247396.4278,169007.48560000001,295763.09960000002,201632.89430000001,352857.56510000001,237971.07740000001,416449.38530000002,261090.09239999999,456907.6617,282875.59529999999,495032.2917]
[4,"Region IV - Southeast",null,"FLORIDA","GAINESVILLE","Row House",90908.566399999996,159089.99119999999,121068.465,211869.8138,149099.6158,260924.32769999999,187475.97070000001,328082.9486,226705.58489999999,396734.77360000001,250320.43489999999,438060.761,272432.0466,476756.08140000002]
[4,"Region IV - Southeast",null,"FLORIDA","GAINESVILLE","Walkup",83662.388600000006,146409.18,115505.3656,202134.3898,146425.55489999999,256244.72099999999,191063.2714,334360.72499999998,237963.5533,416436.2182,267722.4817,468514.3431,297017.9878,519781.47869999998]
[4,"Region IV - Southeast",null,"FLORIDA","GAINESVILLE","Elevator",93838.253899999996,150141.20860000001,131373.55549999999,210197.69200000001,168908.85709999999,270254.17540000001,225211.8095,360338.90049999999,281514.76189999998,450423.62569999998,319050.06349999999,510480.1091,356585.36499999999,570536.59250000003]
[4,"Region IV - Southeast",null,"FLORIDA","JACKSONVILLE","Detached/Semi-Detached",112656.70699999999,197149.23740000001,146380.45910000001,256165.8034,175054.2291,306344.90100000001,208924.71900000001,365618.25829999999,246632.02559999999,431606.04479999997,270615.7941,473577.6398,293237.74209999997,513166.04869999998]
[4,"Region IV - Southeast",null,"FLORIDA","JACKSONVILLE","Row House",93742.341400000005,164049.0975,124976.22560000001,218708.39490000001,154064.40969999999,269612.717,193998.397,339497.1949,234754.27799999999,410819.9865,259260.8291,453706.4509,282226.6091,493896.56589999999]
[4,"Region IV - Southeast",null,"FLORIDA","JACKSONVILLE","Walkup",86047.604099999997,150583.30710000001,118756.5162,207823.90340000001,150492.48920000001,263361.85609999998,196259.1765,343453.5588,244411.39449999999,427719.94040000002,274922.99469999998,481115.24060000002,304945.98639999999,533655.47620000003]
[4,"Region IV - Southeast",null,"FLORIDA","JACKSONVILLE","Elevator",97114.061400000006,155382.5006,135959.68599999999,217535.50090000001,174805.31049999999,279688.50109999999,233073.74739999999,372918.00140000001,291342.18430000002,466147.50180000003,330187.8088,528300.50199999998,369033.43339999998,590453.50230000005]
[4,"Region IV - Southeast",null,"FLORIDA","LAKELAND","Detached/Semi-Detached",108972.8705,190702.52340000001,141636.14739999999,247863.25779999999,169417.40919999999,296480.46610000002,202248.42189999999,353934.73820000002,238786.9222,417877.11379999999,262023.13,458540.47749999998,283954.12660000002,496919.7218]
[4,"Region IV - Southeast",null,"FLORIDA","LAKELAND","Row House",90448.435899999997,158284.7628,120673.23910000001,211178.1685,148860.37040000001,260505.6483,187629.85980000001,328352.25459999999,227154.07709999999,397519.6349,250902.28829999999,439079.00459999999,273170.02779999998,478047.54859999998]
[4,"Region IV - Southeast",null,"FLORIDA","LAKELAND","Walkup",82876.987500000003,145034.72820000001,114352.9135,200117.5986,144875.96100000001,253532.93169999999,188861.14199999999,330506.99849999999,235182.66750000001,411569.66800000001,264506.58689999999,462886.52710000001,293351.97249999997,513365.95179999998]
[4,"Region IV - Southeast",null,"FLORIDA","LAKELAND","Elevator",93933.3321,150293.33360000001,131506.66500000001,210410.66699999999,169079.99780000001,270528.00050000002,225439.997,360704.00060000003,281799.9963,450880.00079999998,319373.32919999998,510997.33419999998,356946.66200000001,571114.66769999999]
[4,"Region IV - Southeast",null,"FLORIDA","MIAMI","Detached/Semi-Detached",112615.04369999999,197076.3265,146291.5385,256010.1925,174917.5871,306105.77740000002,208719.54199999999,365259.19839999999,246360.07569999999,431130.13250000001,270304.77980000002,473033.36459999997,292878.22950000002,512536.90159999998]
[4,"Region IV - Southeast",null,"FLORIDA","MIAMI","Row House",93895.719200000007,164317.5086,125107.9684,218938.94459999999,154144.1586,269752.27769999998,193947.1004,339407.42560000002,234604.77970000001,410558.36459999997,259066.8768,453367.0343,281980.6139,493466.07429999998]
[4,"Region IV - Southeast",null,"FLORIDA","MIAMI","Walkup",86309.406000000003,151041.46049999999,119140.6692,208496.17110000001,151009.02359999999,264265.79129999998,196993.22399999999,344738.14199999999,245338.36199999999,429342.1335,275994.96590000001,482991.19050000003,306167.9988,535793.99789999996]
[4,"Region IV - Southeast",null,"FLORIDA","MIAMI","Elevator",97082.368499999997,155331.79199999999,135915.31589999999,217464.50880000001,174748.26329999999,279597.2255,232997.6845,372796.30060000002,291247.10560000001,465995.37589999998,330080.05300000001,528128.09259999997,368913.00030000001,590260.80940000003]
[4,"Region IV - Southeast",null,"FLORIDA","ORLANDO","Detached/Semi-Detached",114456.9639,200299.6868,148663.69699999999,260161.46969999999,177736.00020000001,311038.00030000001,212057.6943,371100.96490000002,250282.63190000001,437994.60570000001,274601.11670000001,480551.95439999999,297520.04259999999,520660.07439999998]
[4,"Region IV - Southeast",null,"FLORIDA","ORLANDO","Row House",95542.673299999995,167199.67819999999,127259.4635,222704.06109999999,156746.1807,274305.81630000001,197131.37229999999,344979.90149999998,238404.88430000001,417208.54749999999,263246.15169999999,460680.76549999998,286508.90950000001,501390.59159999999]
[4,"Region IV - Southeast",null,"FLORIDA","ORLANDO","Walkup",87894.715299999996,153815.7518,121342.47199999999,212349.3259,153817.28950000001,269180.25650000002,200692.24350000001,351211.42609999998,249952.72820000001,437417.2745,281203.17290000001,492105.5526,311965.00910000002,545938.76599999995]
[4,"Region IV - Southeast",null,"FLORIDA","ORLANDO","Elevator",98672.734800000006,157876.3781,138141.82870000001,221026.92929999999,177610.92259999999,284177.48050000001,236814.56359999999,378903.30739999999,296018.20449999999,473629.13429999998,335487.29840000003,536779.68539999996,374956.39230000001,599930.23670000001]
[4,"Region IV - Southeast",null,"FLORIDA","PANAMA CITY","Detached/Semi-Detached",104272.31849999999,182476.5575,135241.55710000001,236672.7248,161520.2543,282660.44500000001,192476.0422,336833.07380000001,227005.46799999999,397259.56910000002,248991.90040000001,435735.82569999999,269647.97379999998,471883.95409999997]
[4,"Region IV - Southeast",null,"FLORIDA","PANAMA CITY","Row House",88088.190300000002,154154.33300000001,116926.5953,204621.54180000001,143559.89430000001,251229.8149,179704.03539999999,314482.06199999998,216842.03510000001,379473.5613,239275.79670000001,418732.64429999999,260226.07689999999,455395.63459999999]
[4,"Region IV - Southeast",null,"FLORIDA","PANAMA CITY","Walkup",81708.673599999995,142990.17869999999,112928.8364,197625.46369999999,143316.48430000001,250803.84760000001,187325.85740000001,327820.25040000002,233376.4577,408408.80099999998,262716.44640000002,459753.78120000003,291638.34759999998,510367.10820000002]
[4,"Region IV - Southeast",null,"FLORIDA","PANAMA CITY","Elevator",89916.118700000006,143865.79199999999,125882.5661,201412.10879999999,161849.01360000001,258958.42559999999,215798.68470000001,345277.9007,269748.35590000002,431597.37599999999,305714.80339999998,489143.69270000001,341681.25089999998,546690.00950000004]
[4,"Region IV - Southeast",null,"FLORIDA","PENSACOLA","Detached/Semi-Detached",108039.48119999999,189069.09220000001,140163.70879999999,245286.49050000001,167430.3567,293003.12420000002,199562.69099999999,349234.70929999999,235394.46799999999,411940.31900000002,258206.58970000001,451861.5319,279650.6102,489388.56770000001]
[4,"Region IV - Southeast",null,"FLORIDA","PENSACOLA","Row House",91075.342099999994,159381.84880000001,120966.09789999999,211690.67129999999,148604.43659999999,260057.76420000001,186175.1655,325806.53950000001,224741.23069999999,393297.15389999998,248022.23980000001,434038.91960000002,269774.64569999999,472105.6299]
[4,"Region IV - Southeast",null,"FLORIDA","PENSACOLA","Walkup",84355.689400000003,147622.4564,116564.13770000001,203987.24110000001,147899.95000000001,258824.9123,193255.80549999999,338197.65960000001,240751.26089999999,421314.70659999998,270988.92420000001,474230.61749999999,300788.35129999998,526379.61470000003]
[4,"Region IV - Southeast",null,"FLORIDA","PENSACOLA","Elevator",93160.233399999997,149056.3757,130424.32670000001,208678.92600000001,167688.42009999999,268301.47619999998,223584.56020000001,357735.30160000001,279480.70020000002,447169.12709999998,316744.79359999998,506791.67729999998,354008.88699999999,566414.22750000004]
[4,"Region IV - Southeast",null,"FLORIDA","SARASOTA","Detached/Semi-Detached",113298.45450000001,198272.29550000001,147230.45689999999,257653.29949999999,176084.7922,308148.38640000002,210174.21780000001,367804.8812,248120.84030000001,434211.47039999999,272255.24489999999,476446.67869999999,295024.68320000003,516293.19569999998]
[4,"Region IV - Southeast",null,"FLORIDA","SARASOTA","Row House",94189.073999999993,164830.87959999999,125605.56140000001,219809.73250000001,154878.58319999999,271037.52059999999,195094.01639999999,341414.52870000002,236120.64180000001,413211.12300000002,260783.21840000001,456370.6323,283900.03340000001,496825.05859999999]
[4,"Region IV - Southeast",null,"FLORIDA","SARASOTA","Walkup",86401.506299999994,151202.63589999999,119234.34910000001,208660.1109,151084.2225,264397.38929999998,197002.81940000001,344754.9338,245331.54010000001,429330.19530000002,275944.41830000002,482902.73200000002,306063.6508,535611.38899999997]
[4,"Region IV - Southeast",null,"FLORIDA","SARASOTA","Elevator",97665.310899999997,156264.49979999999,136731.43530000001,218770.29980000001,175797.55970000001,281276.09960000002,234396.74619999999,375034.79950000002,292995.9327,468793.49939999997,332062.05709999998,531299.29929999996,371128.1814,593805.09920000006]
[4,"Region IV - Southeast",null,"FLORIDA","TALLAHASSEE","Detached/Semi-Detached",111289.88559999999,194757.29990000001,144502.62289999999,252879.59020000001,172719.81959999999,302259.68430000002,206015.36850000001,360526.8947,243110.49830000001,425443.37190000003,266714.86570000002,466751.01500000001,288944.83679999999,505653.4644]
[4,"Region IV - Southeast",null,"FLORIDA","TALLAHASSEE","Row House",93155.630900000004,163022.35399999999,123981.0387,216966.81770000001,152595.56030000001,267042.2304,191704.56529999999,335482.98920000001,231722.55489999999,405514.47110000002,255828.14689999999,447699.25709999999,278387.77130000002,487178.59980000003]
[4,"Region IV - Southeast",null,"FLORIDA","TALLAHASSEE","Walkup",85863.402000000002,150260.9535,118569.1542,207496.01980000001,150342.08840000001,263098.65460000001,196239.98130000001,343419.96730000002,244425.03270000001,427743.80719999998,275024.08360000001,481292.14630000002,305154.67509999999,534020.68130000005]
[4,"Region IV - Southeast",null,"FLORIDA","TALLAHASSEE","Elevator",95948.176900000006,153517.08530000001,134327.44760000001,214923.91940000001,172706.71830000001,276330.75339999999,230275.6244,368441.00459999999,287844.5306,460551.25569999998,326223.80129999999,521958.08970000001,364603.07199999999,583364.92390000005]
[4,"Region IV - Southeast",null,"FLORIDA","TAMPA","Detached/Semi-Detached",112014.95570000001,196026.17249999999,145530.45619999999,254678.2984,174023.6599,304541.40480000002,207675.2127,363431.62229999999,245143.20209999999,429000.60379999998,268976.33360000001,470708.58380000002,291450.7904,510038.88309999998]
[4,"Region IV - Southeast",null,"FLORIDA","TAMPA","Row House",93295.606199999995,163267.31090000001,124346.8861,217607.05059999999,153250.23139999999,268187.90509999997,192902.77110000001,337579.84950000001,233387.90609999999,408428.8358,257738.43059999999,451042.2536,280553.17469999997,490968.05570000003]
[4,"Region IV - Southeast",null,"FLORIDA","TAMPA","Walkup",85693.699800000002,149963.97459999999,118278.6805,206987.69089999999,149900.7524,262326.31670000002,195515.52910000001,342152.17599999998,243491.24340000001,426109.67599999998,273901.5649,479327.73859999998,303828.31530000002,531699.55169999995]
[4,"Region IV - Southeast",null,"FLORIDA","TAMPA","Elevator",96562.808699999994,154500.49619999999,135187.93220000001,216300.69459999999,173813.05549999999,278100.89309999999,231750.7408,370801.19079999998,289688.42599999998,463501.48849999998,328313.54940000002,525301.68689999997,366938.6728,587101.88529999997]
[4,"Region IV - Southeast",null,"GEORGIA","ALBANY","Detached/Semi-Detached",105514.1505,184649.7634,136852.63260000001,239492.10709999999,163444.73929999999,286028.29379999998,194769.86410000001,340847.26209999999,229711.14910000001,401994.51079999999,251959.78940000001,440929.63140000001,272862.3455,477509.10460000002]
[4,"Region IV - Southeast",null,"GEORGIA","ALBANY","Row House",89135.032300000006,155986.30660000001,118317.0089,207054.76560000001,145267.9896,254218.98180000001,181843.97779999999,318226.96110000001,219425.26509999999,383994.21399999998,242126.6243,423721.59259999997,263326.93190000003,460822.13079999998]
[4,"Region IV - Southeast",null,"GEORGIA","ALBANY","Walkup",82678.278300000005,144686.98689999999,114268.6528,199970.14240000001,145016.48209999999,253778.8437,189547.1863,331707.576,236143.71100000001,413251.49410000001,265831.2586,465204.70260000002,295095.68160000001,516417.44280000002]
[4,"Region IV - Southeast",null,"GEORGIA","ALBANY","Elevator",90986.924899999998,145579.08199999999,127381.6948,203810.71479999999,163776.46479999999,262042.34760000001,218368.61979999999,349389.79680000001,272960.77470000001,436737.24609999999,309355.54460000002,494968.87880000001,345750.31469999999,553200.51170000003]
[4,"Region IV - Southeast",null,"GEORGIA","ATHENS","Detached/Semi-Detached",104522.29730000001,182914.0202,135775.07769999999,237606.3861,162340.10250000001,284095.17920000001,193707.09839999999,338987.42219999997,228637.1593,400115.02879999997,250857.9774,439001.46049999999,271805.03879999998,475658.81780000002]
[4,"Region IV - Southeast",null,"GEORGIA","ATHENS","Row House",87167.9283,152543.87460000001,116136.1428,203238.24979999999,143081.40299999999,250392.45540000001,180011.81400000001,315020.67440000002,217739.0203,381043.2855,240439.50469999999,420769.13339999999,261702.04079999999,457978.57150000002]
[4,"Region IV - Southeast",null,"GEORGIA","ATHENS","Walkup",80137.869900000005,140241.27230000001,110623.93,193591.87760000001,140217.2934,245380.2635,182921.59400000001,320112.78950000001,227814.68059999999,398675.69099999999,256284.65040000001,448498.13819999999,284306.30949999997,497536.04149999999]
[4,"Region IV - Southeast",null,"GEORGIA","ATHENS","Elevator",90106.275099999999,144170.04240000001,126148.7852,201838.05929999999,162191.29519999999,259506.07620000001,216255.06030000001,346008.1017,270318.82539999997,432510.12709999998,306361.33549999999,490178.14399999997,342403.8455,547846.16099999996]
[4,"Region IV - Southeast",null,"GEORGIA","ATLANTA","Detached/Semi-Detached",116815.63830000001,204427.367,151619.08749999999,265333.4031,181175.04569999999,317056.33,216029.80910000001,378052.16600000003,254878.14739999999,446036.75780000002,279603.8554,489306.74670000002,302870.2525,530022.94169999997]
[4,"Region IV - Southeast",null,"GEORGIA","ATLANTA","Row House",98096.488800000006,171668.8553,130435.51730000001,228262.15530000001,160401.61730000001,280702.83020000003,201257.3676,352200.3933,243122.85140000001,425464.98989999999,268365.9523,469640.41649999999,291972.63679999998,510952.11440000002]
[4,"Region IV - Southeast",null,"GEORGIA","ATLANTA","Walkup",90619.327300000004,158583.82279999999,125174.55899999999,219055.47839999999,158766.88200000001,277842.04350000003,207337.03520000001,362839.81160000002,258268.12599999999,451969.2206,290648.6985,508635.22259999998,322545.69990000001,564454.97490000003]
[4,"Region IV - Southeast",null,"GEORGIA","ATLANTA","Elevator",100719.269,161150.83290000001,141006.97659999999,225611.16589999999,181294.68410000001,290071.49900000001,241726.24559999999,386761.9987,302157.80699999997,483452.49849999999,342445.51459999999,547912.83149999997,382733.22210000001,612373.16469999996]
[4,"Region IV - Southeast",null,"GEORGIA","AUGUSTA","Detached/Semi-Detached",106714.31939999999,186750.0589,138374.78820000001,242155.8793,165232.58309999999,289157.02049999998,196858.51010000001,344502.39260000002,232144.8817,406253.5429,254616.66579999999,445579.16519999999,275717.20679999999,482505.11180000001]
[4,"Region IV - Southeast",null,"GEORGIA","AUGUSTA","Row House",90335.251099999994,158086.68960000001,119839.16439999999,209718.53769999999,147055.8334,257347.70850000001,183932.6238,321882.09169999999,221858.99780000001,388253.24619999999,244783.50080000001,428371.1263,266181.79310000001,465818.13809999998]
[4,"Region IV - Southeast",null,"GEORGIA","AUGUSTA","Walkup",83909.683300000004,146841.94579999999,115992.61990000001,202987.08480000001,147233.01120000001,257657.7696,192502.55850000001,336879.47720000002,239837.92610000001,419716.37060000002,270018.03580000001,472531.56270000001,299775.0208,524606.28639999998]
[4,"Region IV - Southeast",null,"GEORGIA","AUGUSTA","Elevator",92026.038400000005,147241.66380000001,128836.4538,206138.32920000001,165646.86919999999,265034.99469999998,220862.49230000001,353379.99280000001,276078.1153,441724.99109999998,312888.5307,500621.65659999999,349698.9461,559518.32200000004]
[4,"Region IV - Southeast",null,"GEORGIA","COLUMBUS","Detached/Semi-Detached",105514.1505,184649.7634,136852.63260000001,239492.10709999999,163444.73929999999,286028.29379999998,194769.86410000001,340847.26209999999,229711.14910000001,401994.51079999999,251959.78940000001,440929.63140000001,272862.3455,477509.10460000002]
[4,"Region IV - Southeast",null,"GEORGIA","COLUMBUS","Row House",89135.032300000006,155986.30660000001,118317.0089,207054.76560000001,145267.9896,254218.98180000001,181843.97779999999,318226.96110000001,219425.26509999999,383994.21399999998,242126.6243,423721.59259999997,263326.93190000003,460822.13079999998]
[4,"Region IV - Southeast",null,"GEORGIA","COLUMBUS","Walkup",82678.278300000005,144686.98689999999,114268.6528,199970.14240000001,145016.48209999999,253778.8437,189547.1863,331707.576,236143.71100000001,413251.49410000001,265831.2586,465204.70260000002,295095.68160000001,516417.44280000002]
[4,"Region IV - Southeast",null,"GEORGIA","COLUMBUS","Elevator",90986.924899999998,145579.08199999999,127381.6948,203810.71479999999,163776.46479999999,262042.34760000001,218368.61979999999,349389.79680000001,272960.77470000001,436737.24609999999,309355.54460000002,494968.87880000001,345750.31469999999,553200.51170000003]
[4,"Region IV - Southeast",null,"GEORGIA","MACON","Detached/Semi-Detached",107481.05989999999,188091.85490000001,139491.55110000001,244110.2144,166673.076,291677.88309999998,198723.54380000001,347766.20169999998,234449.55,410286.71240000002,257189.16390000001,450081.03690000001,278582.69,487519.70740000001]
[4,"Region IV - Southeast",null,"GEORGIA","MACON","Row House",90321.855899999995,158063.24780000001,120073.2781,210128.23670000001,147630.76629999999,258353.84099999999,185182.13879999999,324068.74290000001,223673.86180000001,391429.25819999998,246887.75270000001,432053.56719999999,268593.20870000002,470038.1153]
[4,"Region IV - Southeast",null,"GEORGIA","MACON","Walkup",83478.186499999996,146086.82639999999,115318.00350000001,201806.5062,146275.15410000001,255981.5197,191044.07629999999,334327.1336,237977.19140000001,416460.08490000002,267823.57069999998,468691.2488,297226.6765,520146.6838]
[4,"Region IV - Southeast",null,"GEORGIA","MACON","Elevator",92672.369399999996,148275.79319999999,129741.3171,207586.11050000001,166810.26490000001,266896.4277,222413.68650000001,355861.90360000002,278017.10810000001,444827.37959999999,315086.05579999997,504137.69679999998,352155.0036,563448.01410000003]
[4,"Region IV - Southeast",null,"GEORGIA","SAVANNAH","Detached/Semi-Detached",109281.3132,191242.29810000001,141774.7844,248105.87280000001,169354.84169999999,296370.973,201856.5128,353248.89740000002,238100.149,416675.26069999998,261174.47870000001,457055.33760000003,282864.98180000001,495013.71830000001]
[4,"Region IV - Southeast",null,"GEORGIA","SAVANNAH","Row House",92122.184200000003,161213.8222,122356.51149999999,214123.89499999999,150312.53200000001,263046.93099999998,188315.1079,329551.4387,227324.46090000001,397817.8064,250873.0674,439027.86790000001,272875.50069999998,477532.1262]
[4,"Region IV - Southeast",null,"GEORGIA","SAVANNAH","Walkup",85325.294099999999,149319.26459999999,117903.95419999999,206331.9198,149599.94769999999,261799.90849999999,195477.13449999999,342084.9853,243518.51420000001,426157.39970000001,274103.7365,479681.53889999999,304245.68530000001,532429.94920000003]
[4,"Region IV - Southeast",null,"GEORGIA","SAVANNAH","Elevator",94231.039699999994,150769.66570000001,131923.45550000001,211077.53200000001,169615.8714,271385.3983,226154.4952,361847.19770000002,282693.11900000001,452308.99709999998,320385.53480000002,512616.86339999997,358077.95069999999,572924.72970000003]
[4,"Region IV - Southeast",null,"GEORGIA","VALDOSTA","Detached/Semi-Detached",102472.06170000001,179326.10800000001,132958.3192,232677.05859999999,158838.48329999999,277967.34570000001,189343.06700000001,331350.36719999998,223354.86180000001,390871.00819999998,245006.5778,428761.5111,265365.67330000002,464389.92839999998]
[4,"Region IV - Southeast",null,"GEORGIA","VALDOSTA","Row House",86287.858399999997,151003.75219999999,114643.35739999999,200625.87549999999,140878.12330000001,246536.7156,176571.06020000001,308999.3553,213191.42879999999,373085.00040000002,235290.47409999999,411758.3297,255943.77650000001,447901.60879999999]
[4,"Region IV - Southeast",null,"GEORGIA","VALDOSTA","Walkup",79861.562300000005,139757.734,110342.88069999999,193100.04120000001,139991.68410000001,244985.44709999999,182892.79029999999,320062.38319999998,227835.12400000001,398711.4669,256436.26819999999,448763.4693,284619.3248,498083.81849999999]
[4,"Region IV - Southeast",null,"GEORGIA","VALDOSTA","Elevator",88357.445300000007,141371.91450000001,123700.42329999999,197920.68030000001,159043.40150000001,254469.446,212057.86859999999,339292.59480000002,265072.3358,424115.74349999998,300415.3138,480664.50929999998,335758.29190000001,537213.27509999997]
[4,"Region IV - Southeast",null,"KENTUCKY","ASHLAND","Detached/Semi-Detached",113981.8651,199468.264,148169.37469999999,259296.40580000001,177251.99660000001,310190.99400000001,211628.89249999999,370350.56180000002,249881.60310000001,437292.80540000001,274205.7083,479859.98940000002,297171.1348,520049.48599999998]
[4,"Region IV - Southeast",null,"KENTUCKY","ASHLAND","Row House",94482.429699999993,165344.25210000001,126103.15519999999,220680.52179999999,155613.00820000001,272322.76429999998,196240.93220000001,343421.63130000001,237636.50279999999,415863.88,262499.55900000001,459374.22820000001,285819.45159999997,500184.04029999999]
[4,"Region IV - Southeast",null,"KENTUCKY","ASHLAND","Walkup",86493.607999999993,151363.81409999999,119328.0312,208824.05470000001,151159.42439999999,264528.9926,197012.4191,344771.73340000003,245324.72390000001,429318.26679999998,275893.87699999998,482814.28480000002,305959.31020000001,535428.79280000005]
[4,"Region IV - Southeast",null,"KENTUCKY","ASHLAND","Elevator",98248.253100000002,157197.20740000001,137547.55429999999,220076.09030000001,176846.85560000001,282954.97320000001,235795.80739999999,377273.29759999999,294744.75939999998,471591.62199999997,334044.06060000003,534470.50490000006,373343.36180000001,597349.38780000003]
[4,"Region IV - Southeast",null,"KENTUCKY","BOWLING GREEN","Detached/Semi-Detached",112656.70699999999,197149.23740000001,146380.45910000001,256165.8034,175054.2291,306344.90100000001,208924.71900000001,365618.25829999999,246632.02559999999,431606.04479999997,270615.7941,473577.6398,293237.74209999997,513166.04869999998]
[4,"Region IV - Southeast",null,"KENTUCKY","BOWLING GREEN","Row House",93742.341400000005,164049.0975,124976.22560000001,218708.39490000001,154064.40969999999,269612.717,193998.397,339497.1949,234754.27799999999,410819.9865,259260.8291,453706.4509,282226.6091,493896.56589999999]
[4,"Region IV - Southeast",null,"KENTUCKY","BOWLING GREEN","Walkup",86047.604099999997,150583.30710000001,118756.5162,207823.90340000001,150492.48920000001,263361.85609999998,196259.1765,343453.5588,244411.39449999999,427719.94040000002,274922.99469999998,481115.24060000002,304945.98639999999,533655.47620000003]
[4,"Region IV - Southeast",null,"KENTUCKY","BOWLING GREEN","Elevator",97114.061400000006,155382.5006,135959.68599999999,217535.50090000001,174805.31049999999,279688.50109999999,233073.74739999999,372918.00140000001,291342.18430000002,466147.50180000003,330187.8088,528300.50199999998,369033.43339999998,590453.50230000005]
[4,"Region IV - Southeast",null,"KENTUCKY","COVINGTON","Detached/Semi-Detached",111498.2012,195121.85219999999,144947.22349999999,253657.64120000001,173403.02660000001,303455.2965,207041.2488,362322.18540000002,244470.24119999999,427822.92210000003,268269.9302,469472.37790000002,290742.39130000002,508799.18479999999]
[4,"Region IV - Southeast",null,"KENTUCKY","COVINGTON","Row House",92388.745699999999,161680.30499999999,123322.3281,215814.0742,152196.8175,266344.43060000002,191961.04749999999,335931.83299999998,232470.04269999999,406822.5748,256797.9037,449396.33159999998,279617.7415,489331.0477]
[4,"Region IV - Southeast",null,"KENTUCKY","COVINGTON","Walkup",84554.398700000005,147970.19760000001,116648.39840000001,204134.6974,147759.42879999999,258579.00039999999,192569.76120000001,336997.0821,239790.21739999999,419632.88059999997,269664.2525,471912.44199999998,299044.6421,523328.12359999999]
[4,"Region IV - Southeast",null,"KENTUCKY","COVINGTON","Elevator",96106.640599999999,153770.62729999999,134549.29689999999,215278.87820000001,172991.95310000001,276787.12900000002,230655.9374,369049.50540000002,288319.92180000001,461311.88179999997,326762.57809999998,522820.13260000001,365205.23430000001,584328.38359999994]
[4,"Region IV - Southeast",null,"KENTUCKY","FRANKFORT","Detached/Semi-Detached",115657.13280000001,202399.98240000001,150185.85250000001,262825.24180000002,179523.84400000001,314166.72690000001,214146.34030000001,374756.09539999999,252716.3645,442253.63799999998,277257.99320000003,485201.48810000002,300374.90379999997,525656.08160000003]
[4,"Region IV - Southeast",null,"KENTUCKY","FRANKFORT","Row House",96742.892099999997,169300.0612,128781.61900000001,225367.8333,158534.0246,277434.5429,199220.0183,348635.03200000001,240838.617,421467.5797,265903.0282,465330.29920000001,289363.7708,506386.59879999998]
[4,"Region IV - Southeast",null,"KENTUCKY","FRANKFORT","Walkup",89126.1204,155970.71059999999,123066.439,215366.2683,156033.81849999999,273059.18239999999,203647.61559999999,356383.3273,253646.94339999999,443882.15100000001,285389.95010000002,499432.41269999999,316644.34830000001,554127.60959999997]
[4,"Region IV - Southeast",null,"KENTUCKY","FRANKFORT","Elevator",99711.848400000003,159538.95980000001,139596.5877,223354.54370000001,179481.32699999999,287170.1275,239308.43609999999,382893.50349999999,299135.54509999999,478616.87929999997,339020.2844,542432.46310000005,378905.02380000002,606248.04709999997]
[4,"Region IV - Southeast",null,"KENTUCKY","LEXINGTON","Detached/Semi-Detached",114456.9639,200299.6868,148663.69699999999,260161.46969999999,177736.00020000001,311038.00030000001,212057.6943,371100.96490000002,250282.63190000001,437994.60570000001,274601.11670000001,480551.95439999999,297520.04259999999,520660.07439999998]
[4,"Region IV - Southeast",null,"KENTUCKY","LEXINGTON","Row House",95542.673299999995,167199.67819999999,127259.4635,222704.06109999999,156746.1807,274305.81630000001,197131.37229999999,344979.90149999998,238404.88430000001,417208.54749999999,263246.15169999999,460680.76549999998,286508.90950000001,501390.59159999999]
[4,"Region IV - Southeast",null,"KENTUCKY","LEXINGTON","Walkup",87894.715299999996,153815.7518,121342.47199999999,212349.3259,153817.28950000001,269180.25650000002,200692.24350000001,351211.42609999998,249952.72820000001,437417.2745,281203.17290000001,492105.5526,311965.00910000002,545938.76599999995]
[4,"Region IV - Southeast",null,"KENTUCKY","LEXINGTON","Elevator",98672.734800000006,157876.3781,138141.82870000001,221026.92929999999,177610.92259999999,284177.48050000001,236814.56359999999,378903.30739999999,296018.20449999999,473629.13429999998,335487.29840000003,536779.68539999996,374956.39230000001,599930.23670000001]
[4,"Region IV - Southeast",null,"KENTUCKY","LOUISVILLE","Detached/Semi-Detached",115657.13280000001,202399.98240000001,150185.85250000001,262825.24180000002,179523.84400000001,314166.72690000001,214146.34030000001,374756.09539999999,252716.3645,442253.63799999998,277257.99320000003,485201.48810000002,300374.90379999997,525656.08160000003]
[4,"Region IV - Southeast",null,"KENTUCKY","LOUISVILLE","Row House",96742.892099999997,169300.0612,128781.61900000001,225367.8333,158534.0246,277434.5429,199220.0183,348635.03200000001,240838.617,421467.5797,265903.0282,465330.29920000001,289363.7708,506386.59879999998]
[4,"Region IV - Southeast",null,"KENTUCKY","LOUISVILLE","Walkup",89126.1204,155970.71059999999,123066.439,215366.2683,156033.81849999999,273059.18239999999,203647.61559999999,356383.3273,253646.94339999999,443882.15100000001,285389.95010000002,499432.41269999999,316644.34830000001,554127.60959999997]
[4,"Region IV - Southeast",null,"KENTUCKY","LOUISVILLE","Elevator",99711.848400000003,159538.95980000001,139596.5877,223354.54370000001,179481.32699999999,287170.1275,239308.43609999999,382893.50349999999,299135.54509999999,478616.87929999997,339020.2844,542432.46310000005,378905.02380000002,606248.04709999997]
[4,"Region IV - Southeast",null,"KENTUCKY","OWENSBORO","Detached/Semi-Detached",112615.04369999999,197076.3265,146291.5385,256010.1925,174917.5871,306105.77740000002,208719.54199999999,365259.19839999999,246360.07569999999,431130.13250000001,270304.77980000002,473033.36459999997,292878.22950000002,512536.90159999998]
[4,"Region IV - Southeast",null,"KENTUCKY","OWENSBORO","Row House",93895.719200000007,164317.5086,125107.9684,218938.94459999999,154144.1586,269752.27769999998,193947.1004,339407.42560000002,234604.77970000001,410558.36459999997,259066.8768,453367.0343,281980.6139,493466.07429999998]
[4,"Region IV - Southeast",null,"KENTUCKY","OWENSBORO","Walkup",86309.406000000003,151041.46049999999,119140.6692,208496.17110000001,151009.02359999999,264265.79129999998,196993.22399999999,344738.14199999999,245338.36199999999,429342.1335,275994.96590000001,482991.19050000003,306167.9988,535793.99789999996]
[4,"Region IV - Southeast",null,"KENTUCKY","OWENSBORO","Elevator",97082.368499999997,155331.79199999999,135915.31589999999,217464.50880000001,174748.26329999999,279597.2255,232997.6845,372796.30060000002,291247.10560000001,465995.37589999998,330080.05300000001,528128.09259999997,368913.00030000001,590260.80940000003]
[4,"Region IV - Southeast",null,"KENTUCKY","PADUCAH","Detached/Semi-Detached",111414.87119999999,194976.02480000001,144769.37839999999,253346.4123,173129.73800000001,302977.04149999999,206630.8897,361604.05699999997,243926.3358,426871.08769999997,267647.89549999998,468383.81699999998,290023.35979999998,507540.87949999998]
[4,"Region IV - Southeast",null,"KENTUCKY","PADUCAH","Row House",92695.496799999994,162217.11929999999,123585.8083,216275.16450000001,152356.30960000001,266623.5417,191858.44820000001,335752.2843,232171.0398,406299.31969999999,256409.99239999999,448717.48670000001,279125.74410000001,488470.05219999998]
[4,"Region IV - Southeast",null,"KENTUCKY","PADUCAH","Walkup",85077.997300000003,148886.49530000001,117416.6969,205479.21969999999,148792.48790000001,260386.85380000001,194037.84299999999,339566.2254,241644.13579999999,422877.2377,271808.17629999999,475664.30859999999,301488.64569999999,527605.12990000006]
[4,"Region IV - Southeast",null,"KENTUCKY","PADUCAH","Elevator",96043.251900000003,153669.20540000001,134460.5526,215136.88750000001,172877.85329999999,276604.56959999999,230503.8046,368806.09269999998,288129.75569999998,461007.61599999998,326547.0564,522475.29800000001,364964.35710000002,583942.98010000004]
[4,"Region IV - Southeast",null,"MISSISSIPPI","BILOXI","Detached/Semi-Detached",110048.0537,192584.09409999999,142891.54740000001,250060.20790000001,170795.33470000001,298891.83559999999,203721.5466,356512.70649999997,240404.8173,420708.4302,263746.9767,461557.20929999999,285730.46500000003,500028.3138]
[4,"Region IV - Southeast",null,"MISSISSIPPI","BILOXI","Row House",92108.788799999995,161190.3805,122590.62519999999,214533.59400000001,150887.46489999999,264053.0637,189564.62289999999,331738.09000000003,229139.32490000001,400993.81849999999,252977.3193,442710.30869999999,275286.91629999998,481752.10350000003]
[4,"Region IV - Southeast",null,"MISSISSIPPI","BILOXI","Walkup",84893.797300000006,148564.1453,117229.33779999999,205151.34109999999,148642.0906,260123.65849999999,194018.65229999999,339532.64169999998,241657.7795,422901.114,271909.27140000003,475841.22499999998,301697.34100000001,527970.34669999999]
[4,"Region IV - Southeast",null,"MISSISSIPPI","BILOXI","Elevator",94877.370599999995,151803.79519999999,132828.31880000001,212525.31330000001,170779.26699999999,273246.83130000002,227705.6894,364329.10840000003,284632.11170000001,455411.38559999998,322583.06,516132.90360000002,360534.00819999998,576854.42169999995]
[4,"Region IV - Southeast",null,"MISSISSIPPI","COLUMBUS","Detached/Semi-Detached",102121.95600000001,178713.42300000001,132730.76209999999,232278.83369999999,158764.40960000001,277837.71669999999,189529.8002,331677.15029999998,223769.68669999999,391596.95179999998,245544.21660000001,429702.37900000002,266095.3077,465666.78850000002]
[4,"Region IV - Southeast",null,"MISSISSIPPI","COLUMBUS","Row House",84767.486999999994,148343.1023,113091.82709999999,197910.69750000001,139505.7101,244134.99280000001,175834.51569999999,307710.40250000003,212871.5477,372525.2084,235125.74400000001,411470.05180000002,255992.30979999999,447986.54210000002]
[4,"Region IV - Southeast",null,"MISSISSIPPI","COLUMBUS","Walkup",77675.056100000002,135931.34820000001,107175.99069999999,187557.98379999999,135784.22870000001,237622.4001,177010.84099999999,309768.97169999999,220426.23929999999,385745.91869999998,247911.08360000001,433844.39620000002,274947.61709999997,481158.32990000001]
[4,"Region IV - Southeast",null,"MISSISSIPPI","COLUMBUS","Elevator",88028.044899999994,140844.87409999999,123239.26300000001,197182.82370000001,158450.4809,253520.7732,211267.30790000001,338027.69770000002,264084.1349,422534.62219999998,299295.3529,478872.57169999997,334506.57089999999,535210.52139999997]
[4,"Region IV - Southeast",null,"MISSISSIPPI","GREENVILLE","Detached/Semi-Detached",105805.79610000001,185160.14309999999,137475.0784,240581.3872,164401.23480000001,287702.16090000002,196206.1035,343360.68119999999,231614.79740000001,405325.89549999998,254136.88870000001,444739.5552,275378.93160000001,481913.13030000002]
[4,"Region IV - Southeast",null,"MISSISSIPPI","GREENVILLE","Row House",88061.396099999998,154107.44330000001,117394.81819999999,205440.93169999999,144709.7548,253242.07079999999,182203.05919999999,318855.35369999998,220471.75580000001,385825.57270000002,243484.29259999999,426097.51209999999,265048.8996,463835.57429999998]
[4,"Region IV - Southeast",null,"MISSISSIPPI","GREENVILLE","Walkup",80845.676300000006,141479.93350000001,111579.59849999999,195264.29749999999,141400.7634,247451.33609999999,184408.88430000001,322715.54749999999,229654.9774,401896.21029999998,258327.50380000001,452073.13160000002,286541.64500000002,501447.8787]
[4,"Region IV - Southeast",null,"MISSISSIPPI","GREENVILLE","Elevator",91208.777400000006,145934.04610000001,127692.2884,204307.66440000001,164175.79930000001,262681.28279999999,218901.06570000001,350241.71039999998,273626.3321,437802.13799999998,310109.8431,496175.75640000001,346593.3541,554549.37479999999]
[4,"Region IV - Southeast",null,"MISSISSIPPI","JACKSON","Detached/Semi-Detached",110606.47500000001,193561.3314,143563.70509999999,251236.48389999999,171552.6153,300217.07679999998,204560.69380000001,357981.21409999998,241349.73540000001,422362.0368,264764.40240000002,463337.70429999998,286798.38520000002,501897.1741]
[4,"Region IV - Southeast",null,"MISSISSIPPI","JACKSON","Row House",92862.275099999999,162508.98149999999,123483.4448,216096.02849999999,151861.13529999999,265756.98670000001,190557.6495,333475.88660000003,230206.69380000001,402861.71419999999,254111.8063,444695.66110000003,276468.35320000001,483819.61800000002]
[4,"Region IV - Southeast",null,"MISSISSIPPI","JACKSON","Walkup",85771.300099999993,150099.77540000001,118475.47199999999,207332.076,150266.88639999999,262967.05129999999,196230.38159999999,343403.1678,244431.84899999999,427755.73560000001,275074.625,481380.59360000002,305259.01579999999,534203.27749999997]
[4,"Region IV - Southeast",null,"MISSISSIPPI","JACKSON","Elevator",95365.234599999996,152584.37779999999,133511.3285,213618.12880000001,171657.42230000001,274651.8798,228876.5631,366202.50640000001,286095.70390000002,457753.13309999998,324241.7978,518786.88410000002,362387.89159999997,579820.63520000002]
[4,"Region IV - Southeast",null,"MISSISSIPPI","LAUREL","Detached/Semi-Detached",103322.12480000001,180813.71840000001,134252.91759999999,234942.6059,160552.25339999999,280966.44329999998,191618.44620000001,335332.28080000001,226203.41940000001,395855.984,248201.09299999999,434351.91279999999,268950.16899999999,470662.79570000002]
[4,"Region IV - Southeast",null,"MISSISSIPPI","LAUREL","Row House",85967.705900000001,150443.4853,114613.98269999999,200574.46969999999,141293.554,247263.7194,177923.1617,311365.5331,215305.28030000001,376784.24060000002,237782.62040000001,416119.5857,258847.17110000001,452982.54930000001]
[4,"Region IV - Southeast",null,"MISSISSIPPI","LAUREL","Walkup",78906.461200000005,138086.307,108899.9578,190574.92619999999,138000.75769999999,241501.326,179966.21309999999,314940.87290000002,224120.45439999999,392210.79519999999,252097.86069999999,441171.25630000001,279626.95630000002,489347.17349999998]
[4,"Region IV - Southeast",null,"MISSISSIPPI","LAUREL","Elevator",89067.158500000005,142507.45569999999,124694.02190000001,199510.43799999999,160320.88529999999,256513.42019999999,213761.18040000001,342017.89370000002,267201.4755,427522.36719999998,302828.33889999997,484525.34940000001,338455.2023,541528.33180000004]
[4,"Region IV - Southeast",null,"MISSISSIPPI","MERIDIAN","Detached/Semi-Detached",105122.3817,183964.16800000001,136536.15549999999,238938.27220000001,163234.02429999999,285659.54259999999,194751.42139999999,340814.98749999999,229854.02559999999,402244.54489999998,252186.41570000001,441326.22739999997,273232.4694,478156.82140000002]
[4,"Region IV - Southeast",null,"MISSISSIPPI","MERIDIAN","Row House",87768.037800000006,153594.06599999999,116897.2205,204570.13589999999,143975.32500000001,251956.8187,181056.13699999999,316848.23969999998,218955.8866,383172.8015,241767.943,423093.90029999998,263129.47149999999,460476.57510000002]
[4,"Region IV - Southeast",null,"MISSISSIPPI","MERIDIAN","Walkup",80753.572400000005,141318.75159999999,111485.9135,195100.34880000001,141325.55799999999,247319.72640000001,184399.2801,322698.7402,229661.78820000001,401908.12920000002,258378.03890000001,452161.56819999998,286645.9791,501630.4633]
[4,"Region IV - Southeast",null,"MISSISSIPPI","MERIDIAN","Elevator",90625.831900000005,145001.33319999999,126876.16469999999,203001.8665,163126.49739999999,261002.39980000001,217501.99660000001,348003.1997,271877.49570000003,435003.99969999999,308127.8284,493004.53289999999,344378.16129999998,551005.0662]
[4,"Region IV - Southeast",null,"MISSISSIPPI","TUPELO","Detached/Semi-Detached",100880.124,176540.21710000001,131119.68659999999,229459.45139999999,156839.92449999999,274469.86790000001,187235.97829999999,327662.9621,221064.00580000001,386862.01,242576.32759999999,424508.57329999999,262880.93599999999,460041.63799999998]
[4,"Region IV - Southeast",null,"MISSISSIPPI","TUPELO","Row House",83720.645000000004,146511.12880000001,111701.4136,195477.4737,137797.61480000001,241145.8259,173694.57329999999,303965.50339999999,210288.31770000001,368004.55579999997,232274.91639999999,406481.10350000003,252891.45480000001,442560.04580000002]
[4,"Region IV - Southeast",null,"MISSISSIPPI","TUPELO","Walkup",76705.451400000005,134234.54,105836.1744,185213.3051,134084.23079999999,234647.40400000001,174789.51199999999,305881.64600000001,217658.98610000001,380903.2255,244796.27129999999,428393.47480000003,271490.2831,475107.99530000001]
[4,"Region IV - Southeast",null,"MISSISSIPPI","TUPELO","Elevator",86957.238800000006,139131.58410000001,121740.1342,194784.2176,156523.02970000001,250436.8512,208697.37289999999,333915.80160000001,260871.71609999999,417394.75199999998,295654.6116,473047.38569999998,330437.50709999999,528700.01930000004]
[4,"Region IV - Southeast",null,"NORTH CAROLINA","ASHEVILLE","Detached/Semi-Detached",117974.1441,206454.75210000001,153052.323,267841.56520000001,182826.24830000001,319945.93449999997,217913.27929999999,381348.2389,257039.93169999999,449819.88050000003,281949.7193,493412.00870000001,305365.60320000001,534389.80570000003]
[4,"Region IV - Southeast",null,"NORTH CAROLINA","ASHEVILLE","Row House",99450.084400000007,174037.64780000001,132089.4148,231156.47589999999,162269.2095,283971.11670000001,203294.71720000001,355765.75510000001,245407.08670000001,429462.40159999998,270828.87760000001,473950.53580000001,294581.50429999997,515517.63250000001]
[4,"Region IV - Southeast",null,"NORTH CAROLINA","ASHEVILLE","Walkup",92112.532699999996,161196.93229999999,127282.67690000001,222744.6845,161499.9424,282624.89919999999,211026.45060000001,369296.28840000002,262889.30310000002,460056.2806,295907.44069999998,517838.02120000002,328447.04430000001,574782.32750000001]
[4,"Region IV - Southeast",null,"NORTH CAROLINA","ASHEVILLE","Elevator",101726.68979999999,162762.70619999999,142417.36569999999,227867.7886,183108.0416,292972.87109999999,244144.05549999999,390630.49469999998,305180.06949999998,488288.11839999998,345870.74540000001,553393.20090000005,386561.42139999999,618498.28330000001]
[4,"Region IV - Southeast",null,"NORTH CAROLINA","CHARLOTTE","Detached/Semi-Detached",119090.9903,208409.23310000001,154396.64309999999,270194.12530000001,184340.8149,322596.42619999999,219591.57990000001,384285.2648,258929.7751,453127.10649999999,283984.5785,496973.01250000001,307501.45209999999,538127.54110000003]
[4,"Region IV - Southeast",null,"NORTH CAROLINA","CHARLOTTE","Row House",100957.06050000001,176674.8559,133875.0589,234281.353,164216.55549999999,287378.97220000002,205280.77669999999,359241.35920000001,247541.83180000001,433198.20569999999,273097.85969999997,477921.25449999998,296944.38660000003,519652.6765]
[4,"Region IV - Southeast",null,"NORTH CAROLINA","CHARLOTTE","Walkup",93867.542100000006,164268.19880000001,129774.9504,227106.16329999999,164749.54070000001,288311.69620000001,215449.9178,377037.35609999998,268437.45319999999,469765.54310000001,302238.16029999999,528916.78040000005,335570.40769999998,587248.21349999995]
[4,"Region IV - Southeast",null,"NORTH CAROLINA","CHARLOTTE","Elevator",102702.42110000001,164323.87609999999,143783.38939999999,230053.4265,184864.3578,295782.97690000001,246485.81039999999,394377.3026,308107.26309999998,492971.62829999998,349188.23149999999,558701.17870000005,390269.19990000001,624430.7291]
[4,"Region IV - Southeast",null,"NORTH CAROLINA","DURHAM","Detached/Semi-Detached",119774.40089999999,209605.2016,155335.56090000001,271837.23149999999,185508.01930000001,324639.03379999998,221046.25459999999,386830.94549999997,260690.53810000001,456208.44140000001,285935.04190000001,500386.32329999999,309647.90360000002,541883.83149999997]
[4,"Region IV - Southeast",null,"NORTH CAROLINA","DURHAM","Row House",101250.4163,177188.2285,134372.65270000001,235152.1421,164950.98060000001,288664.21590000001,206427.6925,361248.46179999999,249057.69289999999,435850.96250000002,274814.20020000002,480924.8504,298863.80479999998,523011.65830000001]
[4,"Region IV - Southeast",null,"NORTH CAROLINA","DURHAM","Walkup",93959.644,164429.37700000001,129868.6326,227270.10699999999,164824.7427,288443.29969999997,215459.51749999999,377054.1556,268430.63689999998,469753.61459999997,302187.6189,528828.33310000005,335466.06709999999,587065.61730000004]
[4,"Region IV - Southeast",null,"NORTH CAROLINA","DURHAM","Elevator",103285.36320000001,165256.58360000001,144599.5085,231359.21710000001,185913.6538,297461.8505,247884.87169999999,396615.80060000002,309856.08970000001,495769.75089999998,351170.23499999999,561872.38430000003,392484.38020000001,627975.01769999997]
[4,"Region IV - Southeast",null,"NORTH CAROLINA","FAYETTEVILLE","Detached/Semi-Detached",116048.90150000001,203085.57769999999,150502.3296,263379.07689999999,179734.55900000001,314535.47810000001,214164.78279999999,374788.37,252573.48790000001,442003.60379999998,277031.36700000003,484804.8922,300004.77990000002,525008.36490000004]
[4,"Region IV - Southeast",null,"NORTH CAROLINA","FAYETTEVILLE","Row House",98109.886700000003,171692.30170000001,130201.4074,227852.46290000001,159826.68919999999,279696.70610000001,200007.8591,350013.75349999999,241307.99549999999,422288.99209999997,266261.7095,465957.99160000001,289561.23119999998,506732.1545]
[4,"Region IV - Southeast",null,"NORTH CAROLINA","FAYETTEVILLE","Walkup",91050.826199999996,159338.94589999999,125849.1783,220236.06200000001,159724.7427,279518.29969999997,208795.52179999999,365392.16310000001,260128.86619999999,455225.5159,292843.16979999997,512475.54710000003,325094.05089999997,568914.58909999998]
[4,"Region IV - Southeast",null,"NORTH CAROLINA","FAYETTEVILLE","Elevator",100072.94130000001,160116.70860000001,140102.11790000001,224163.39199999999,180131.29440000001,288210.07539999997,240175.05929999999,384280.1005,300218.82410000003,480350.12569999998,340248.00069999998,544396.80909999995,380277.17719999998,608443.49250000005]
[4,"Region IV - Southeast",null,"NORTH CAROLINA","GASTONIA","Detached/Semi-Detached",120332.8222,210582.43900000001,156007.71859999999,273013.50750000001,186265.29990000001,325964.27490000002,221885.40169999999,388299.45309999998,261635.45610000001,457862.04810000001,286952.46759999997,502166.81819999998,310715.82380000001,543752.69169999997]
[4,"Region IV - Southeast",null,"NORTH CAROLINA","GASTONIA","Row House",102003.9025,178506.82949999999,135265.4724,236714.57670000001,165924.65090000001,290368.13900000002,207420.71909999999,362986.25839999999,250125.0618,437718.85820000002,275948.68729999999,482910.20280000003,300045.24160000001,525079.17279999994]
[4,"Region IV - Southeast",null,"NORTH CAROLINA","GASTONIA","Walkup",94837.146900000007,165965.00700000001,131114.76680000001,229450.842,166449.5385,291286.6924,217671.24669999999,380924.68170000002,271204.70640000002,474608.23619999998,305352.97249999997,534367.70180000004,339027.74180000002,593298.54810000001]
[4,"Region IV - Southeast",null,"NORTH CAROLINA","GASTONIA","Elevator",103773.2273,166037.16620000001,145282.51819999999,232452.03260000001,186791.80910000001,298866.89899999998,249055.74540000001,398489.1986,311319.68180000002,498111.49839999998,352828.97279999999,564526.36470000003,394338.26360000001,630941.23120000004]
[4,"Region IV - Southeast",null,"NORTH CAROLINA","GREENSBORO","Detached/Semi-Detached",118490.9059,207359.08540000001,153635.56529999999,268862.23920000001,183446.89309999999,321032.06280000001,218547.25690000001,382457.69959999999,257712.9088,450997.59039999999,282656.14039999997,494648.24560000002,306074.02149999997,535629.53760000004]
[4,"Region IV - Southeast",null,"NORTH CAROLINA","GREENSBORO","Row House",100356.95110000001,175624.66450000001,133113.9811,232949.46679999999,163322.63370000001,285814.60889999999,204236.45370000001,357413.79399999999,246324.96549999999,431068.68959999998,271769.4215,475596.48759999999,295516.95600000001,517154.67290000001]
[4,"Region IV - Southeast",null,"NORTH CAROLINA","GREENSBORO","Walkup",93251.839600000007,163190.7194,128912.9669,225597.69209999999,163641.27609999999,286372.23320000002,213972.23180000001,374451.40549999999,266590.3456,466533.10489999998,300144.77169999998,525253.3504,333230.73810000002,583153.79169999994]
[4,"Region IV - Southeast",null,"NORTH CAROLINA","GREENSBORO","Elevator",102182.8642,163492.58530000001,143056.01,228889.61929999999,183929.1557,294286.65340000001,245238.87419999999,392382.2046,306548.59279999998,490477.75579999998,347421.73849999998,555874.78969999996,388294.88410000002,621271.82389999996]
[4,"Region IV - Southeast",null,"NORTH CAROLINA","HICKORY","Detached/Semi-Detached",114165.3183,199789.30710000001,148041.2512,259072.18960000001,176779.50459999999,309364.13309999998,210621.4547,368587.54570000002,248378.9835,434663.22110000002,272424.01740000001,476742.0306,295003.45640000002,516256.04869999998]
[4,"Region IV - Southeast",null,"NORTH CAROLINA","HICKORY","Row House",96616.309399999998,169078.54149999999,128181.65429999999,224317.89490000001,157304.41560000001,275282.72720000002,196772.29079999999,344351.50890000002,237358.39360000001,415377.1887,261888.4834,458304.84600000002,284786.94179999997,498377.14809999999]
[4,"Region IV - Southeast",null,"NORTH CAROLINA","HICKORY","Walkup",89727.317299999995,157022.8052,124031.52619999999,217055.17079999999,157433.00810000001,275507.76419999998,205830.54550000001,360203.4547,256441.46179999999,448772.55829999998,288706.9278,505237.1237,320519.04570000002,560908.32999999996]
[4,"Region IV - Southeast",null,"NORTH CAROLINA","HICKORY","Elevator",98450.882299999997,157521.41409999999,137831.2352,220529.9797,177211.5882,283538.5453,236282.1176,378051.39380000002,295352.6471,472564.24229999998,334733,535572.80790000001,374113.3529,598581.37360000005]
[4,"Region IV - Southeast",null,"NORTH CAROLINA","RALEIGH","Detached/Semi-Detached",118574.22840000001,207504.89980000001,153813.4008,269173.45130000002,183720.17019999999,321510.2978,218957.6023,383175.80410000001,258256.79810000001,451949.39659999998,283278.15749999997,495736.77559999999,306793.03389999998,536887.80929999996]
[4,"Region IV - Southeast",null,"NORTH CAROLINA","RALEIGH","Row House",100050.19379999999,175087.83919999999,132850.49249999999,232488.36199999999,163163.13140000001,285535.48,204339.04019999999,357593.32040000003,246623.95300000001,431591.91769999999,272157.31589999999,476275.3027,296008.935,518015.6361]
[4,"Region IV - Southeast",null,"NORTH CAROLINA","RALEIGH","Walkup",92728.2353,162274.4117,128144.66039999999,224253.1557,162608.20689999999,284564.36219999997,212504.1366,371882.239,264736.41070000001,463288.71879999997,298000.82929999998,521501.45120000001,330786.71389999997,578876.74930000002]
[4,"Region IV - Southeast",null,"NORTH CAROLINA","RALEIGH","Elevator",102246.2466,163593.99710000001,143144.7452,229031.59580000001,184043.2438,294469.19459999999,245390.99179999999,392625.59269999998,306738.73979999998,490781.99099999998,347637.23839999997,556219.58970000001,388535.73700000002,621657.18850000005]
[4,"Region IV - Southeast",null,"NORTH CAROLINA","ROCKY MOUNT","Detached/Semi-Detached",114848.73269999999,200985.28219999999,148980.1741,260715.30470000001,177946.71520000001,311406.75140000001,212076.13680000001,371133.23940000002,250139.75520000001,437744.57160000002,274374.49050000001,480155.35840000003,297149.91869999998,520012.35769999999]
[4,"Region IV - Southeast",null,"NORTH CAROLINA","ROCKY MOUNT","Row House",96909.667799999996,169591.91870000001,128679.2519,225188.69070000001,158038.84539999999,276567.97950000002,197919.21309999999,346358.62290000002,238874.2628,418029.95990000002,263604.83299999998,461308.45779999997,286706.36989999999,501736.14730000001]
[4,"Region IV - Southeast",null,"NORTH CAROLINA","ROCKY MOUNT","Walkup",89819.421100000007,157183.9871,124125.21120000001,217219.11970000001,157508.21350000001,275639.3738,205840.14970000001,360220.26189999998,256434.65109999999,448760.63939999999,288656.39260000002,505148.68709999998,320414.71169999999,560725.74549999996]
[4,"Region IV - Southeast",null,"NORTH CAROLINA","ROCKY MOUNT","Elevator",99033.827799999999,158454.1269,138647.35889999999,221835.77770000001,178260.89009999999,285217.42839999998,237681.1868,380289.9045,297101.48340000003,475362.38069999998,336715.0147,538744.03139999998,376328.54570000002,602125.68220000004]
[4,"Region IV - Southeast",null,"NORTH CAROLINA","WILMINGTON","Detached/Semi-Detached",116048.90150000001,203085.57769999999,150502.3296,263379.07689999999,179734.55900000001,314535.47810000001,214164.78279999999,374788.37,252573.48790000001,442003.60379999998,277031.36700000003,484804.8922,300004.77990000002,525008.36490000004]
[4,"Region IV - Southeast",null,"NORTH CAROLINA","WILMINGTON","Row House",98109.886700000003,171692.30170000001,130201.4074,227852.46290000001,159826.68919999999,279696.70610000001,200007.8591,350013.75349999999,241307.99549999999,422288.99209999997,266261.7095,465957.99160000001,289561.23119999998,506732.1545]
[4,"Region IV - Southeast",null,"NORTH CAROLINA","WILMINGTON","Walkup",91050.826199999996,159338.94589999999,125849.1783,220236.06200000001,159724.7427,279518.29969999997,208795.52179999999,365392.16310000001,260128.86619999999,455225.5159,292843.16979999997,512475.54710000003,325094.05089999997,568914.58909999998]
[4,"Region IV - Southeast",null,"NORTH CAROLINA","WILMINGTON","Elevator",100072.94130000001,160116.70860000001,140102.11790000001,224163.39199999999,180131.29440000001,288210.07539999997,240175.05929999999,384280.1005,300218.82410000003,480350.12569999998,340248.00069999998,544396.80909999995,380277.17719999998,608443.49250000005]
[4,"Region IV - Southeast",null,"NORTH CAROLINA","WINSTON-SALEM","Detached/Semi-Detached",115923.9121,202866.8461,150235.56899999999,262912.24579999998,179324.63449999999,313818.1103,213549.25409999999,373711.19469999999,251757.6415,440575.8725,276098.32750000001,483172.07319999998,298926.2463,523120.93119999999]
[4,"Region IV - Southeast",null,"NORTH CAROLINA","WINSTON-SALEM","Row House",98570.018200000006,172497.53169999999,130596.63400000001,228544.1096,160065.9351,280115.38630000001,199853.96969999999,349744.44699999999,240859.5024,421504.12920000002,265679.85489999998,464939.74609999999,288823.24849999999,505440.68479999999]
[4,"Region IV - Southeast",null,"NORTH CAROLINA","WINSTON-SALEM","Walkup",91836.228799999997,160713.40049999999,127001.6326,222252.85709999999,161274.33970000001,282230.0944,210997.6557,369245.89740000002,262909.75760000001,460092.07579999999,296059.071,518103.37420000002,328760.0736,575330.12879999995]
[4,"Region IV - Southeast",null,"NORTH CAROLINA","WINSTON-SALEM","Elevator",99977.862999999998,159964.58319999999,139969.00829999999,223950.41649999999,179960.15349999999,287936.24979999999,239946.87119999999,383914.99979999999,299933.58909999998,479893.74969999999,339924.73420000001,543879.58290000004,379915.87949999998,607865.41630000004]
[4,"Region IV - Southeast",null,"SOUTH CAROLINA","CHARLESTON","Detached/Semi-Detached",119132.6534,208482.14350000001,154485.56299999999,270349.7353,184477.45619999999,322835.54830000002,219796.75580000001,384644.32250000001,259201.72339999999,453603.0159,284295.59110000002,497517.2844,307860.96250000002,538756.68449999997]
[4,"Region IV - Southeast",null,"SOUTH CAROLINA","CHARLESTON","Row House",100803.68369999999,176406.44649999999,133743.31690000001,234050.8045,164136.80710000001,287239.41239999997,205332.07310000001,359331.12790000002,247691.32920000001,433459.826,273291.81089999998,478260.66899999999,297190.38030000002,520083.16560000001]
[4,"Region IV - Southeast",null,"SOUTH CAROLINA","CHARLESTON","Walkup",93605.741800000003,163810.04819999999,129390.79979999999,226433.8996,164233.00940000001,287407.76640000002,214715.87469999999,375752.7806,267510.49129999999,468143.35969999997,301166.19530000002,527040.84180000005,334348.40259999997,585109.70449999999]
[4,"Region IV - Southeast",null,"SOUTH CAROLINA","CHARLESTON","Elevator",102734.11380000001,164374.58439999999,143827.75930000001,230124.41819999999,184921.40470000001,295874.25199999998,246561.87289999999,394499.00260000001,308202.34120000002,493123.75329999998,349295.98670000001,558873.58700000006,390389.63219999999,624623.42079999996]
[4,"Region IV - Southeast",null,"SOUTH CAROLINA","COLUMBIA","Detached/Semi-Detached",115365.4872,201889.60260000001,149563.40669999999,261735.96179999999,178567.34839999999,312492.85979999998,212710.10070000001,372242.67629999999,250812.71609999999,438922.25329999998,275080.89390000002,481391.56439999997,297858.31760000001,521252.05589999998]
[4,"Region IV - Southeast",null,"SOUTH CAROLINA","COLUMBIA","Row House",97816.528300000005,171178.92449999999,129703.8098,226981.66709999999,159092.25940000001,278411.45390000002,198860.9368,348006.63949999999,239792.1263,419636.22090000001,264545.35989999998,462954.3798,287641.80300000001,503373.15529999998]
[4,"Region IV - Southeast",null,"SOUTH CAROLINA","COLUMBIA","Walkup",90958.722299999994,159177.764,125755.4932,220072.11319999999,159649.53719999999,279386.69,208785.91759999999,365375.35580000002,260135.677,455237.43489999999,292893.70490000001,512563.98369999998,325198.3849,569097.17370000004]
[4,"Region IV - Southeast",null,"SOUTH CAROLINA","COLUMBIA","Elevator",99489.995899999994,159183.99590000001,139285.99419999999,222857.59409999999,179081.99249999999,286531.1924,238775.9901,382041.58980000002,298469.9877,477551.98739999998,338265.98599999998,541225.58559999999,378061.98430000001,604899.18389999995]
[4,"Region IV - Southeast",null,"SOUTH CAROLINA","FLORENCE","Detached/Semi-Detached",111764.9771,195588.70980000001,144996.93549999999,253744.6372,173203.81169999999,303106.67050000001,206444.15650000001,361277.27380000002,243511.51089999999,426145.14409999998,267110.25660000002,467442.94900000002,289293.7254,506264.01939999999]
[4,"Region IV - Southeast",null,"SOUTH CAROLINA","FLORENCE","Row House",94215.868100000007,164877.76930000001,125137.3386,218990.3426,153728.72270000001,269025.2647,192594.9926,337041.23700000002,232490.921,406859.11170000001,256574.72260000001,449005.76449999999,279077.2108,488385.1188]
[4,"Region IV - Southeast",null,"SOUTH CAROLINA","FLORENCE","Walkup",87264.503500000006,152712.8811,120583.58689999999,211021.27710000001,152999.94330000001,267749.9007,199919.79250000001,349859.63679999998,249053.02050000001,435842.78600000002,280333.36099999998,490583.38170000003,311160.35340000002,544530.61840000004]
[4,"Region IV - Southeast",null,"SOUTH CAROLINA","FLORENCE","Elevator",96372.652100000007,154196.2458,134921.71299999999,215874.74410000001,173470.7738,277553.24239999999,231294.3652,370070.98989999999,289117.95649999997,462588.73729999998,327667.01730000001,524267.23560000001,366216.07819999999,585945.73400000005]
[4,"Region IV - Southeast",null,"SOUTH CAROLINA","GREENVILLE","Detached/Semi-Detached",116732.3121,204281.54629999999,151441.24739999999,265022.18300000002,180901.76319999999,316578.0857,215619.45749999999,377334.05060000002,254334.25080000001,445084.93890000001,278981.83020000003,488218.20299999998,302151.23149999999,528764.65520000004]
[4,"Region IV - Southeast",null,"SOUTH CAROLINA","GREENVILLE","Row House",98403.242400000003,172205.67430000001,130699.0013,228723.25210000001,160561.11420000001,280981.9498,201154.77480000001,352020.85600000003,242823.8566,424941.74900000001,267978.05,468961.58750000002,291480.64929999999,510091.13630000001]
[4,"Region IV - Southeast",null,"SOUTH CAROLINA","GREENVILLE","Walkup",91142.928100000005,159500.12409999999,125942.86040000001,220400.00580000001,159799.94459999999,279649.9031,208805.12160000001,365408.96269999997,260122.04990000001,455213.58730000001,292792.62849999999,512387.09980000003,324989.71029999998,568731.99289999995]
[4,"Region IV - Southeast",null,"SOUTH CAROLINA","GREENVILLE","Elevator",100655.8836,161049.41620000001,140918.23699999999,225469.1825,181180.59039999999,289888.94900000002,241574.12049999999,386518.59860000003,301967.6507,483148.24839999998,342230.00410000002,547568.01470000006,382492.35759999999,611987.78119999997]
[4,"Region IV - Southeast",null,"SOUTH CAROLINA","ROCK HILL","Detached/Semi-Detached",114848.73269999999,200985.28219999999,148980.1741,260715.30470000001,177946.71520000001,311406.75140000001,212076.13680000001,371133.23940000002,250139.75520000001,437744.57160000002,274374.49050000001,480155.35840000003,297149.91869999998,520012.35769999999]
[4,"Region IV - Southeast",null,"SOUTH CAROLINA","ROCK HILL","Row House",96909.667799999996,169591.91870000001,128679.2519,225188.69070000001,158038.84539999999,276567.97950000002,197919.21309999999,346358.62290000002,238874.2628,418029.95990000002,263604.83299999998,461308.45779999997,286706.36989999999,501736.14730000001]
[4,"Region IV - Southeast",null,"SOUTH CAROLINA","ROCK HILL","Walkup",89819.421100000007,157183.9871,124125.21120000001,217219.11970000001,157508.21350000001,275639.3738,205840.14970000001,360220.26189999998,256434.65109999999,448760.63939999999,288656.39260000002,505148.68709999998,320414.71169999999,560725.74549999996]
[4,"Region IV - Southeast",null,"SOUTH CAROLINA","ROCK HILL","Elevator",99033.827799999999,158454.1269,138647.35889999999,221835.77770000001,178260.89009999999,285217.42839999998,237681.1868,380289.9045,297101.48340000003,475362.38069999998,336715.0147,538744.03139999998,376328.54570000002,602125.68220000004]
[4,"Region IV - Southeast",null,"SOUTH CAROLINA","SPARTANBURG","Detached/Semi-Detached",116648.986,204135.7255,151263.40729999999,264710.96299999999,180628.48079999999,316099.84139999998,215209.10579999999,376615.93520000001,253790.35430000001,444133.11989999999,278359.8052,487129.65909999999,301432.21059999999,527506.36840000004]
[4,"Region IV - Southeast",null,"SOUTH CAROLINA","SPARTANBURG","Row House",98709.996100000004,172742.4932,130962.48510000001,229184.34899999999,160720.61110000001,281261.06949999998,201052.18210000001,351841.3187,242524.86180000001,424418.50819999998,267590.14769999997,468282.7585,290988.6618,509230.1581]
[4,"Region IV - Southeast",null,"SOUTH CAROLINA","SPARTANBURG","Walkup",91666.528699999995,160416.42540000001,126711.1618,221744.53320000001,160833.00719999999,281457.76260000002,210273.20790000001,367978.11379999999,261975.97390000001,458457.95419999998,294936.55839999998,516138.97710000002,327433.7205,573009.01089999999]
[4,"Region IV - Southeast",null,"SOUTH CAROLINA","SPARTANBURG","Elevator",100592.4981,160947.99950000001,140829.49729999999,225327.1992,181066.49660000001,289706.39889999997,241421.99549999999,386275.1985,301777.49440000003,482843.99829999998,342014.49369999999,547223.19799999997,382251.49290000001,611602.39780000004]
[4,"Region IV - Southeast",null,"TENNESSEE","CHATTANOOGA","Detached/Semi-Detached",111373.20819999999,194903.11439999999,144680.45850000001,253190.80230000001,172993.0968,302737.91930000001,206425.7139,361244.99930000002,243654.38759999999,426395.17810000002,267336.88290000003,467839.54509999999,289663.8492,506911.73619999998]
[4,"Region IV - Southeast",null,"TENNESSEE","CHATTANOOGA","Row House",92848.873600000006,162485.5288,123717.5503,216505.71290000001,152436.05799999999,266763.10159999999,191807.15169999999,335662.51559999998,232021.54250000001,406037.69929999998,256216.04130000001,448378.0722,278879.75030000001,488039.56300000002]
[4,"Region IV - Southeast",null,"TENNESSEE","CHATTANOOGA","Walkup",85339.797600000005,149344.6459,117800.84759999999,206151.4834,149309.01920000001,261290.78349999999,194771.88630000001,340850.80080000003,242571.09770000001,424499.42109999998,272880.14120000001,477540.24719999998,302710.6508,529743.63890000002]
[4,"Region IV - Southeast",null,"TENNESSEE","CHATTANOOGA","Elevator",96011.559200000003,153618.497,134416.18290000001,215065.8958,172820.80650000001,276513.29450000002,230427.742,368684.39270000003,288034.6776,460855.49089999998,326439.30119999999,522302.8897,364843.92489999998,583750.28839999996]
[4,"Region IV - Southeast",null,"TENNESSEE","COLUMBIA","Detached/Semi-Detached",102722.0404,179763.57070000001,133491.83979999999,233610.71979999999,159658.3314,279402.08,190574.1232,333504.7156,224986.55300000001,393726.46789999999,246872.65479999999,432027.1459,267522.73830000003,468164.79210000002]
[4,"Region IV - Southeast",null,"TENNESSEE","COLUMBIA","Row House",85367.596399999995,149393.29380000001,113852.90489999999,199242.58360000001,140399.63200000001,245699.3561,176878.83869999999,309537.96779999998,214088.41399999999,374654.72450000001,236454.18220000001,413794.8187,257419.74040000001,450484.54570000002]
[4,"Region IV - Southeast",null,"TENNESSEE","COLUMBIA","Walkup",78290.758600000001,137008.82750000001,108037.9742,189066.45499999999,136892.4932,239561.86309999999,178488.527,312354.92239999998,222273.3469,388978.35690000001,250004.47210000001,437507.82620000001,277287.2867,485252.75170000002]
[4,"Region IV - Southeast",null,"TENNESSEE","COLUMBIA","Elevator",88547.601699999999,141676.1649,123966.6424,198346.63080000001,159385.68309999999,255017.09669999999,212514.24419999999,340022.79570000002,265642.8052,425028.49469999998,301061.84590000001,481698.96059999999,336480.88660000003,538369.42649999994]
[4,"Region IV - Southeast",null,"TENNESSEE","JACKSON","Detached/Semi-Detached",107606.0494,188310.5864,139758.31169999999,244577.04550000001,167083.00049999999,292395.25089999998,199339.07260000001,348843.37689999997,235265.3965,411714.4437,258122.2034,451713.85590000002,279661.22350000002,489407.14110000001]
[4,"Region IV - Southeast",null,"TENNESSEE","JACKSON","Row House",89861.724400000006,157258.0177,119678.0514,209436.59,147391.52050000001,257935.16080000001,185336.02830000001,324338.04940000002,224122.35490000001,392214.12109999999,247469.6073,433071.81270000001,269331.19150000002,471329.58510000003]
[4,"Region IV - Southeast",null,"TENNESSEE","JACKSON","Walkup",82692.783899999995,144712.37179999999,114165.54919999999,199789.71109999999,144725.55710000001,253269.7249,188841.9425,330473.39929999999,235196.3,411593.52510000003,264607.66950000002,463063.4216,293560.65379999997,513731.14419999998]
[4,"Region IV - Southeast",null,"TENNESSEE","JACKSON","Elevator",92767.447700000004,148427.9186,129874.4268,207799.08590000001,166981.40590000001,267170.25329999998,222641.87450000001,356227.00449999998,278302.3431,445283.75559999997,315409.3222,504654.92300000001,352516.30129999999,564026.09030000004]
[4,"Region IV - Southeast",null,"TENNESSEE","JOHNSON CITY","Detached/Semi-Detached",101480.20849999999,177590.36489999999,131880.76430000001,230791.33749999999,157733.84640000001,276034.23129999998,188280.30129999999,329490.52730000002,222280.87220000001,388991.52610000002,243904.76579999999,426833.34019999998,264308.36660000001,462539.64159999997]
[4,"Region IV - Southeast",null,"TENNESSEE","JOHNSON CITY","Row House",84320.754400000005,147561.32019999999,112462.49129999999,196809.35980000001,138691.5367,242710.18919999999,174738.89629999999,305793.0686,211505.18400000001,370134.07189999998,233603.35459999999,408805.87040000001,254318.8854,445058.04940000002]
[4,"Region IV - Southeast",null,"TENNESSEE","JOHNSON CITY","Walkup",77321.153999999995,135312.01930000001,106698.15790000001,186721.7763,135192.49540000001,236586.86689999999,176267.19810000001,308467.59659999999,219506.09359999999,384135.66379999998,246889.6599,432056.90480000002,273829.95260000002,479202.41710000002]
[4,"Region IV - Southeast",null,"TENNESSEE","JOHNSON CITY","Elevator",87476.795499999993,139962.87479999999,122467.51360000001,195948.02480000001,157458.23190000001,251933.17480000001,209944.30910000001,335910.8996,262430.38640000002,419888.62459999998,297421.10460000002,475873.7745,332411.82280000002,531858.92449999996]
[4,"Region IV - Southeast",null,"TENNESSEE","KNOXVILLE","Detached/Semi-Detached",107005.96490000001,187260.43859999999,138997.23389999999,243245.1594,166189.07860000001,290830.88750000001,198294.74960000001,347015.81160000002,234048.5301,409584.9277,256793.76509999999,449389.08909999998,278233.7929,486909.13750000001]
[4,"Region IV - Southeast",null,"TENNESSEE","KNOXVILLE","Row House",89261.615000000005,156207.82629999999,118916.9736,208104.70389999999,146497.5986,256370.79749999999,184291.7052,322510.4841,222905.48860000001,390084.60499999998,246141.16899999999,430747.04580000002,267903.76089999999,468831.58149999997]
[4,"Region IV - Southeast",null,"TENNESSEE","KNOXVILLE","Walkup",82077.081300000005,143634.89240000001,113303.56570000001,198281.23989999999,143617.29259999999,251330.26190000001,187364.25640000001,327887.44870000001,233349.1925,408361.08689999999,262514.28090000001,459399.99160000001,291220.98420000001,509636.72230000002]
[4,"Region IV - Southeast",null,"TENNESSEE","KNOXVILLE","Elevator",92247.890899999999,147596.62779999999,129147.04730000001,206635.2787,166046.20370000001,265673.92979999998,221394.9382,354231.90649999998,276743.6728,442789.88309999998,313642.82919999998,501828.53409999999,350541.98550000001,560867.18519999995]
[4,"Region IV - Southeast",null,"TENNESSEE","MEMPHIS","Detached/Semi-Detached",111331.5487,194830.21030000001,144591.54300000001,253035.20009999999,172856.46090000001,302498.80650000001,206220.54430000001,360885.95240000001,243382.44649999999,425919.28139999998,267025.87829999998,467295.28690000001,289304.34720000002,506282.6078]
[4,"Region IV - Southeast",null,"TENNESSEE","MEMPHIS","Row House",93002.254000000001,162753.94450000001,123849.29670000001,216736.26930000001,152515.8118,266902.67060000001,191755.86170000001,335572.75780000002,231872.05230000001,405776.09159999999,256022.098,448038.6716,278633.76500000001,487609.08889999997]
[4,"Region IV - Southeast",null,"TENNESSEE","MEMPHIS","Walkup",85601.601599999995,149802.80290000001,118185.00350000001,206823.7562,149825.55710000001,262194.72489999997,195505.9382,342135.39179999998,243498.07070000001,426121.6238,273952.11869999999,479416.20779999997,303932.67,531882.17229999998]
[4,"Region IV - Southeast",null,"TENNESSEE","MEMPHIS","Elevator",95979.869600000005,153567.7936,134371.8174,214994.91099999999,172763.76519999999,276422.02840000001,230351.6869,368562.7046,287939.60869999998,460703.38079999998,326331.55650000001,522130.49810000003,364723.50429999997,583557.61560000002]
[4,"Region IV - Southeast",null,"TENNESSEE","NASHVILLE","Detached/Semi-Detached",113173.465,198053.56390000001,146963.69630000001,257186.46849999999,175674.86780000001,307431.01860000001,209558.68909999999,366727.7059,247304.9938,432783.73910000001,271322.20549999998,474813.85960000003,293946.1496,514405.76189999998]
[4,"Region IV - Southeast",null,"TENNESSEE","NASHVILLE","Row House",94649.205400000006,165636.10949999999,126000.78810000001,220501.37909999999,155117.8291,271456.2009,194940.12700000001,341145.22220000002,235672.14869999999,412426.26020000002,260201.36379999999,455352.38679999998,283162.05070000002,495533.58870000002]
[4,"Region IV - Southeast",null,"TENNESSEE","NASHVILLE","Walkup",87186.908899999995,152577.09049999999,120386.8034,210676.90590000001,152633.81950000001,267109.18400000001,199204.95319999999,348608.66810000001,248112.43150000001,434196.75510000001,279160.31949999998,488530.55910000001,309729.67359999998,542026.92870000005]
[4,"Region IV - Southeast",null,"TENNESSEE","NASHVILLE","Elevator",97570.232600000003,156112.37450000001,136598.32560000001,218557.32430000001,175626.4186,281002.27399999998,234168.55809999999,374669.6986,292710.69770000002,468337.12339999998,331738.79070000001,530782.07310000004,370766.88380000001,593227.02289999998]
[5,"Region V - Midwest",null,"ILLINOIS","BLOOMINGTON","Detached/Semi-Detached",130120.9538,227711.66899999999,169039.62220000001,295819.33880000003,202123.239,353715.66820000001,241191.25810000001,422084.70169999998,284693.90220000001,498214.32880000002,312367.03240000003,546642.30669999996,338457.80249999999,592301.1544]
[5,"Region V - Midwest",null,"ILLINOIS","BLOOMINGTON","Row House",108452.84759999999,189792.48319999999,144519.09839999999,252908.42230000001,178077.46479999999,311635.56349999999,224091.77960000001,392160.61420000001,271086.8468,474401.98180000001,299358.8725,523878.0269,325843.53399999999,570226.18440000003]
[5,"Region V - Midwest",null,"ILLINOIS","BLOOMINGTON","Walkup",99665.42,174414.48499999999,137572.47700000001,240751.83470000001,174364.9423,305138.64909999998,227448.8757,398035.53230000002,283265.6545,495714.89539999998,318655.4878,557647.10369999998,353485.57520000002,618599.75659999996]
[5,"Region V - Midwest",null,"ILLINOIS","BLOOMINGTON","Elevator",112172.86470000001,179476.5863,157042.01070000001,251267.22089999999,201911.15659999999,323057.8554,269214.87540000002,430743.80719999998,336518.5944,538429.75899999996,381387.7402,610220.39339999994,426256.8861,682011.02800000005]
[5,"Region V - Midwest",null,"ILLINOIS","CARBONDALE","Detached/Semi-Detached",128727.9311,225273.87950000001,167127.08249999999,292472.39449999999,199746.75409999999,349556.8198,238230.89379999999,416904.06410000002,281111.5907,491945.28360000002,308399.16979999997,539698.54709999997,334091.94150000002,584660.89769999997]
[5,"Region V - Midwest",null,"ILLINOIS","CARBONDALE","Row House",107847.8967,188733.8193,143498.21599999999,251121.878,176575.37349999999,309006.90370000002,221753.21580000001,388068.1275,267999.3382,468998.8419,295864.03480000002,517762.06099999999,321936.37459999998,563388.65549999999]
[5,"Region V - Midwest",null,"ILLINOIS","CARBONDALE","Walkup",99466.767099999997,174066.8425,137365.6035,240389.80609999999,174190.37899999999,304833.16310000001,227399.3144,397948.8002,283241.71909999999,495673.00839999999,318714.86739999999,557751.01800000004,353648.62420000002,618885.09239999996]
[5,"Region V - Midwest",null,"ILLINOIS","CARBONDALE","Elevator",110984.47380000001,177575.16080000001,155378.26329999999,248605.22500000001,199772.0528,319635.2892,266362.73700000002,426180.38569999998,332953.42139999999,532725.48210000002,377347.2108,603755.54630000005,421741.00030000001,674785.61069999996]
[5,"Region V - Midwest",null,"ILLINOIS","CENTRALIA","Detached/Semi-Detached",129976.3192,227458.55859999999,168746.84169999999,295306.9731,201681.76749999999,352943.0931,240537.48069999999,420940.59110000002,283832.48149999999,496706.84259999997,311383.8076,544921.66319999995,337324.56880000001,590317.99549999996]
[5,"Region V - Midwest",null,"ILLINOIS","CENTRALIA","Row House",108899.3026,190573.77960000001,144895.05900000001,253566.35320000001,178291.78649999999,312010.62640000001,223904.3511,391832.61440000002,270596.52720000001,473543.92259999999,298730.4154,522778.22690000001,325054.32549999998,568845.06960000005]
[5,"Region V - Midwest",null,"ILLINOIS","CENTRALIA","Walkup",100439.98729999999,175769.97779999999,138710.3015,242743.0276,175896.42189999999,307818.73839999997,229628.24050000001,401849.42090000003,286018.3726,500532.152,321840.11469999998,563220.20059999998,357117.37640000001,624955.40870000003]
[5,"Region V - Midwest",null,"ILLINOIS","CENTRALIA","Elevator",112060.91160000001,179297.4613,156885.2764,251016.44589999999,201709.641,322735.43030000001,268946.18800000002,430313.90710000001,336182.73499999999,537892.38399999996,381007.09960000002,609611.36849999998,425831.46429999999,681330.35309999995]
[5,"Region V - Midwest",null,"ILLINOIS","CHAMPAIGN","Detached/Semi-Detached",132424.86840000001,231743.51980000001,171888.7464,300805.30609999999,205404.61230000001,359458.07140000002,244932.6985,428632.22230000002,288987.087,505727.40230000002,317025.30209999997,554794.27859999996,343412.03590000002,600971.06290000002]
[5,"Region V - Midwest",null,"ILLINOIS","CHAMPAIGN","Row House",111150.92200000001,194514.11350000001,147814.04990000001,258674.58730000001,181796.0336,318143.05869999999,228144.11919999999,399252.20870000002,275627.43239999999,482348.00670000003,304253.65399999998,532443.89450000005,331027.11749999999,579297.45570000005]
[5,"Region V - Midwest",null,"ILLINOIS","CHAMPAIGN","Walkup",102644.60830000001,179628.06460000001,141778.9607,248113.1813,179818.98689999999,314683.22710000002,234812.52979999999,410921.92719999998,292489.23019999999,511856.15289999999,329152.12670000002,576016.22180000006,365265.45439999999,639214.54520000005]
[5,"Region V - Midwest",null,"ILLINOIS","CHAMPAIGN","Elevator",114176.4564,182682.33300000001,159847.03899999999,255755.26620000001,205517.62160000001,328828.19939999998,274023.49550000002,438437.5993,342529.36930000002,548046.99910000002,388199.95189999999,621119.93220000004,433870.53450000001,694192.86549999996]
[5,"Region V - Midwest",null,"ILLINOIS","CHICAGO","Detached/Semi-Detached",150454.08850000001,263294.65480000002,195228.7451,341650.3039,233241.424,408172.49209999997,278051.141,486589.49660000001,328009.0809,574015.89159999997,359810.70299999998,629668.73030000005,389718.25910000002,682006.9534]
[5,"Region V - Midwest",null,"ILLINOIS","CHICAGO","Row House",126619.4765,221584.08369999999,168256.16880000001,294448.2953,206791.0722,361884.37640000001,259241.7144,453673.0001,313041.3198,547822.30960000004,345501.72700000001,604628.02229999995,375842.56359999999,657724.48620000004]
[5,"Region V - Midwest",null,"ILLINOIS","CHICAGO","Walkup",117143.54210000001,205001.1986,161845.93669999999,283230.38919999998,205322.2806,359313.99099999998,268221.5552,469387.72159999999,334126.95990000002,584722.17980000004,376060.40850000002,658105.71499999997,417378.13660000003,730411.73910000001]
[5,"Region V - Midwest",null,"ILLINOIS","CHICAGO","Elevator",129728.7519,207566.0062,181620.25270000001,290592.40860000002,233511.75339999999,373618.81109999999,311349.00459999999,498158.41489999997,389186.25579999998,622698.01859999995,441077.75650000002,705724.42099999997,492969.2573,788750.82350000006]
[5,"Region V - Midwest",null,"ILLINOIS","DECATUR","Detached/Semi-Detached",130528.1844,228424.32269999999,169410.31589999999,296468.0527,202428.51990000001,354249.90970000002,241363.8628,422386.7599,284762.18969999999,498333.83189999999,312384.48450000002,546672.84779999999,338374.23340000003,592154.90850000002]
[5,"Region V - Midwest",null,"ILLINOIS","DECATUR","Row House",109648.22500000001,191884.39379999999,145781.44930000001,255117.53630000001,179257.13930000001,313699.99369999999,224886.18470000001,393550.82329999999,271649.93719999999,475387.39010000002,299849.34950000001,524736.36170000001,326218.66649999999,570882.66630000004]
[5,"Region V - Midwest",null,"ILLINOIS","DECATUR","Walkup",101313.8747,177299.28080000001,139951.55410000001,244915.21969999999,177515.17259999999,310651.55200000003,231832.3726,405706.652,288783.04180000001,505370.32319999998,324995.0331,568741.30799999996,360667.63299999997,631168.35770000005]
[5,"Region V - Midwest",null,"ILLINOIS","DECATUR","Elevator",112543.1441,180069.03330000001,157560.40169999999,252096.64660000001,202577.6594,324124.2598,270103.54580000002,432165.67969999998,337629.43229999999,540207.09970000002,382646.6899,612234.71290000004,427663.94750000001,684262.32629999996]
[5,"Region V - Midwest",null,"ILLINOIS","EAST ST. LOUIS","Detached/Semi-Detached",129976.3192,227458.55859999999,168746.84169999999,295306.9731,201681.76749999999,352943.0931,240537.48069999999,420940.59110000002,283832.48149999999,496706.84259999997,311383.8076,544921.66319999995,337324.56880000001,590317.99549999996]
[5,"Region V - Midwest",null,"ILLINOIS","EAST ST. LOUIS","Row House",108899.3026,190573.77960000001,144895.05900000001,253566.35320000001,178291.78649999999,312010.62640000001,223904.3511,391832.61440000002,270596.52720000001,473543.92259999999,298730.4154,522778.22690000001,325054.32549999998,568845.06960000005]
[5,"Region V - Midwest",null,"ILLINOIS","EAST ST. LOUIS","Walkup",100439.98729999999,175769.97779999999,138710.3015,242743.0276,175896.42189999999,307818.73839999997,229628.24050000001,401849.42090000003,286018.3726,500532.152,321840.11469999998,563220.20059999998,357117.37640000001,624955.40870000003]
[5,"Region V - Midwest",null,"ILLINOIS","EAST ST. LOUIS","Elevator",112060.91160000001,179297.4613,156885.2764,251016.44589999999,201709.641,322735.43030000001,268946.18800000002,430313.90710000001,336182.73499999999,537892.38399999996,381007.09960000002,609611.36849999998,425831.46429999999,681330.35309999995]
[5,"Region V - Midwest",null,"ILLINOIS","GALESBURG","Detached/Semi-Detached",128776.15029999999,225358.26310000001,167224.6862,292643.2009,199893.92370000001,349814.3665,238448.83470000001,417285.4607,281398.7488,492447.81030000001,308726.93109999999,540272.12950000004,334469.70750000002,585321.98829999997]
[5,"Region V - Midwest",null,"ILLINOIS","GALESBURG","Row House",107699.08379999999,188473.39660000001,143372.90349999999,250902.58100000001,176503.94270000001,308881.89980000001,221815.70509999999,388177.48389999999,268162.79450000002,469284.89039999997,296073.53889999999,518128.69309999997,322199.46419999999,563849.06240000005]
[5,"Region V - Midwest",null,"ILLINOIS","GALESBURG","Walkup",99208.582299999995,173615.019,136986.33439999999,239726.0852,173679.89290000001,303939.8125,226672.86840000001,396677.5197,282324.15740000003,494067.27559999999,317653.33740000002,555893.34050000005,352438.03720000002,616766.56519999995]
[5,"Region V - Midwest",null,"ILLINOIS","GALESBURG","Elevator",111021.7982,177634.87959999999,155430.51740000001,248688.8315,199839.2366,319742.78330000001,266452.31550000003,426323.71110000001,333065.39439999999,532904.63890000002,377474.11369999999,603958.59080000001,421882.83289999998,675012.54260000004]
[5,"Region V - Midwest",null,"ILLINOIS","JOLIET","Detached/Semi-Detached",147957.32060000001,258925.31099999999,191989.23800000001,335981.1666,229371.41149999999,401399.97009999998,273437.98489999998,478516.47350000002,322567.32059999998,564492.81110000005,353841.45110000001,619222.53929999995,383253.03039999999,670692.80319999997]
[5,"Region V - Midwest",null,"ILLINOIS","JOLIET","Row House",124516.6683,217904.16949999999,165462.4889,289559.35560000001,203358.25520000001,355876.94640000002,254939.45759999999,446144.05080000003,307846.96029999998,538732.18039999995,339768.98680000001,594595.72699999996,369606.685,646811.69869999995]
[5,"Region V - Midwest",null,"ILLINOIS","JOLIET","Walkup",115197.10279999999,201594.92989999999,159156.54199999999,278523.9485,201910.19560000001,353342.84230000002,263763.70329999999,461586.48070000001,328573.65299999999,575003.89269999997,369809.91379999998,647167.34920000006,410440.6311,718271.10459999996]
[5,"Region V - Midwest",null,"ILLINOIS","JOLIET","Elevator",127575.8832,204121.41630000001,178606.2366,285769.9828,229636.58979999999,367418.54920000001,306182.11979999999,489891.39899999998,382727.64970000001,612364.2487,433758.00300000003,694012.81519999995,484788.35639999999,775661.38170000003]
[5,"Region V - Midwest",null,"ILLINOIS","KANKAKEE","Detached/Semi-Detached",146398.12479999999,256196.71849999999,190193.97200000001,332839.451,227425.43160000001,397994.50530000002,271394.64490000001,474940.6286,320352.4228,560616.73990000004,351494.8444,615115.97770000005,380859.46120000002,666504.05720000004]
[5,"Region V - Midwest",null,"ILLINOIS","KANKAKEE","Row House",121972.2482,213451.4345,162552.65470000001,284467.1458,200319.28649999999,350558.75150000001,252118.8694,441208.02140000003,305013.56050000002,533773.73089999997,336831.10070000001,589454.42630000005,366639.74050000001,641619.54599999997]
[5,"Region V - Midwest",null,"ILLINOIS","KANKAKEE","Walkup",112059.0497,196103.33689999999,154674.21720000001,270679.8799,196032.93599999999,343057.63780000003,255698.3702,447472.14779999998,318444.46679999999,557277.81680000003,358222.0367,626888.56429999997,397368.62030000001,695395.08550000004]
[5,"Region V - Midwest",null,"ILLINOIS","KANKAKEE","Elevator",126203.8015,201926.08540000001,176685.32199999999,282696.51949999999,227166.84270000001,363466.95360000001,302889.12349999999,484622.60489999998,378611.4044,605778.2561,429092.92499999999,686548.69019999995,479574.44559999998,767319.12439999997]
[5,"Region V - Midwest",null,"ILLINOIS","PEORIA","Detached/Semi-Detached",131824.78400000001,230693.372,171127.6686,299473.42,204510.69029999999,357893.70809999999,243888.37549999999,426804.65710000001,287770.22070000001,503597.88620000001,315696.8639,552469.51170000003,341984.6053,598473.05929999996]
[5,"Region V - Midwest",null,"ILLINOIS","PEORIA","Row House",110550.8126,193463.92189999999,147052.97210000001,257342.70120000001,180902.11170000001,316578.69540000003,227099.79629999999,397424.6434,274410.5661,480218.49060000002,302925.21580000001,530119.12760000001,329599.68680000002,576799.45200000005]
[5,"Region V - Midwest",null,"ILLINOIS","PEORIA","Walkup",102028.90579999999,178550.5851,140916.97719999999,246604.7101,178710.7224,312743.76419999998,233334.8438,408335.97659999999,290642.1226,508623.71460000001,327058.73810000002,572352.79169999994,362925.78480000002,635120.12340000004]
[5,"Region V - Midwest",null,"ILLINOIS","PEORIA","Elevator",113656.89969999999,181851.0422,159119.65960000001,254591.45910000001,204582.41940000001,327331.87589999998,272776.55920000002,436442.5012,340970.69900000002,545553.12659999996,386433.45890000003,618293.54339999997,431896.21879999997,691033.96030000004]
[5,"Region V - Midwest",null,"ILLINOIS","QUINCY","Detached/Semi-Detached",133769.67180000001,234096.92559999999,173703.68229999999,303981.44390000001,207633.92749999999,363359.37310000003,247675.1219,433431.4633,292282.24040000001,511493.92080000002,320665.40340000001,561164.45589999994,347400.13089999999,607950.22900000005]
[5,"Region V - Midwest",null,"ILLINOIS","QUINCY","Row House",111904.68580000001,195833.20009999999,148960.24489999999,260680.42860000001,183369.55559999999,320896.72230000002,230420.1937,403235.33899999998,278551.48460000003,487465.0981,307538.9877,538193.22829999996,334671.18729999999,585674.57779999997]
[5,"Region V - Midwest",null,"ILLINOIS","QUINCY","Walkup",103101.446,180427.53049999999,142365.10329999999,249138.9308,180504.03640000001,315882.0637,235588.53709999999,412279.93979999999,293430.72720000002,513503.77269999997,330154.27710000001,577769.98490000004,366312.99239999999,641047.73659999995]
[5,"Region V - Midwest",null,"ILLINOIS","QUINCY","Elevator",115327.52310000001,184524.03969999999,161458.53229999999,258333.6556,207589.54149999999,332143.27149999997,276786.05540000001,442857.69520000002,345982.56929999997,553572.11919999996,392113.5785,627381.73490000004,438244.58779999998,701191.35089999996]
[5,"Region V - Midwest",null,"ILLINOIS","ROCK ISLAND","Detached/Semi-Detached",127672.40089999999,223426.70170000001,165897.71299999999,290320.99790000002,198400.38889999999,347200.68060000002,236796.03400000001,414393.05959999998,279539.2893,489193.75630000001,306725.52990000002,536769.67740000004,332370.32689999999,581648.07209999999]
[5,"Region V - Midwest",null,"ILLINOIS","ROCK ISLAND","Row House",106201.22470000001,185852.14309999999,141600.103,247800.18030000001,174573.21249999999,305503.12190000003,219852.00520000001,384741.00900000002,266055.93430000002,465597.88500000001,293835.62599999999,514212.3455,319870.73340000003,559773.78339999996]
[5,"Region V - Midwest",null,"ILLINOIS","ROCK ISLAND","Walkup",97460.795299999998,170556.39189999999,134503.8125,235381.67189999999,170442.3707,298274.14870000002,222264.57750000001,388963.01069999998,276794.78590000002,484390.87530000001,311343.4633,544851.06070000003,345337.48320000002,604340.59569999995]
[5,"Region V - Midwest",null,"ILLINOIS","ROCK ISLAND","Elevator",110057.31690000001,176091.70970000001,154080.24359999999,246528.39350000001,198103.1704,316965.07740000001,264137.56050000002,422620.10320000001,330171.95079999999,528275.12899999996,374194.8775,598711.81279999996,418217.80420000001,669148.49670000002]
[5,"Region V - Midwest",null,"ILLINOIS","ROCKFORD","Detached/Semi-Detached",139266.86180000001,243717.00820000001,180748.57819999999,316310.01189999998,215973.54949999999,377953.71169999999,257509.89300000001,450642.31270000001,303808.33240000001,531664.58180000004,333276.84649999999,583234.48140000005,361002.51260000002,631754.39729999995]
[5,"Region V - Midwest",null,"ILLINOIS","ROCKFORD","Row House",117008.041,204764.07190000001,155559.31359999999,272228.79879999999,191271.9822,334725.96889999998,239944.0655,419902.11459999997,289830.17589999997,507202.80780000001,319913.91899999999,559849.35820000002,348044.21899999998,609077.38320000004]
[5,"Region V - Midwest",null,"ILLINOIS","ROCKFORD","Walkup",108126.39780000001,189221.19630000001,149364.41570000001,261387.72760000001,189457.44409999999,331550.52710000001,247434.8193,433010.93369999999,308219.57209999999,539384.25109999999,346871.71480000002,607025.50100000005,384948.84580000001,673660.48019999999]
[5,"Region V - Midwest",null,"ILLINOIS","ROCKFORD","Elevator",120078.17570000001,192125.0839,168109.44589999999,268975.11739999999,216140.71609999999,345825.15090000001,288187.6214,461100.20120000001,360234.5269,576375.25159999996,408265.79710000003,653225.28500000003,456297.0674,730075.31869999995]
[5,"Region V - Midwest",null,"ILLINOIS","SPRINGFIELD","Detached/Semi-Detached",129831.67690000001,227205.43470000001,168454.05119999999,294794.5895,201240.2836,352170.4963,239883.6882,419796.45439999999,282971.0428,495199.32490000001,310400.56300000002,543200.98529999994,336191.3137,588334.79890000005]
[5,"Region V - Midwest",null,"ILLINOIS","SPRINGFIELD","Row House",109345.75229999999,191355.06649999999,145271.01190000001,254224.2708,178506.09849999999,312385.67229999998,223716.90950000001,391504.59149999998,270106.1912,472685.8345,298101.9399,521678.39480000001,324265.0968,567463.91949999996]
[5,"Region V - Midwest",null,"ILLINOIS","SPRINGFIELD","Walkup",101214.55039999999,177125.4633,139848.12030000001,244734.21040000001,177427.89439999999,310498.81530000002,231807.59650000001,405663.29389999999,288771.0797,505349.38939999999,325024.7291,568793.27590000001,360749.1642,631311.03740000003]
[5,"Region V - Midwest",null,"ILLINOIS","SPRINGFIELD","Elevator",111948.9519,179118.32569999999,156728.53270000001,250765.65599999999,201508.11350000001,322412.98629999999,268677.48460000003,429883.9817,335846.85570000001,537354.97719999996,380626.43640000001,609002.30740000005,425406.0172,680649.63769999996]
[5,"Region V - Midwest",null,"INDIANA","ANDERSON","Detached/Semi-Detached",111898.891,195823.05910000001,145309.25339999999,254291.1936,173697.80300000001,303971.15529999998,207201.11730000001,362601.95529999997,244523.3529,427915.8676,268270.67109999998,469473.67430000001,290640.60749999998,508621.06300000002]
[5,"Region V - Midwest",null,"INDIANA","ANDERSON","Row House",93579.570999999996,163764.24919999999,124578.26549999999,218011.96470000001,153368.1943,268394.33990000002,192744.28570000001,337302.4999,233019.20619999999,407783.61080000002,257272.8633,450227.51079999999,279975.81689999998,489957.67959999997]
[5,"Region V - Midwest",null,"INDIANA","ANDERSON","Walkup",86199.248000000007,150848.6839,119022.6078,208289.56359999999,150903.6312,264081.35450000002,196945.6833,344654.94569999998,245298.23209999999,429271.90610000002,275993.39380000002,482988.43920000002,306215.31579999998,535876.80260000005]
[5,"Region V - Midwest",null,"INDIANA","ANDERSON","Elevator",96471.301300000006,154354.0845,135059.82190000001,216095.71830000001,173648.34239999999,277837.35200000001,231531.1232,370449.8027,289413.90409999999,463062.25339999999,328002.42450000002,524803.88710000005,366590.94510000001,586545.5209]
[5,"Region V - Midwest",null,"INDIANA","BLOOMINGTON","Detached/Semi-Detached",118092.58869999999,206662.03020000001,153310.41469999999,268293.22570000001,183225.66209999999,320644.90879999998,218516.0643,382403.11259999999,257840.59340000001,451221.03850000002,282866.03759999998,495015.56569999998,306425.91129999998,536245.34459999995]
[5,"Region V - Midwest",null,"INDIANA","BLOOMINGTON","Row House",98985.398100000006,173224.4466,131687.7709,230453.59899999999,162021.6611,283537.90700000001,203437.43309999999,356015.50790000003,245841.64449999999,430222.87780000002,271395.20559999999,474941.60969999997,295302.41979999997,516779.23460000003]
[5,"Region V - Midwest",null,"INDIANA","BLOOMINGTON","Walkup",91323.522500000006,159816.16450000001,126125.3518,220719.36559999999,159944.31390000001,279902.54940000002,208816.73730000001,365429.29029999999,260099.0336,455173.3088,292681.12920000002,512191.97629999998,324769.63079999998,568346.85389999999]
[5,"Region V - Midwest",null,"INDIANA","BLOOMINGTON","Elevator",101816.14629999999,162905.8365,142542.6047,228068.17110000001,183269.06330000001,293230.50559999997,244358.75099999999,390974.00750000001,305448.4388,488717.50939999998,346174.89730000001,553879.84389999998,386901.35580000002,619042.17850000004]
[5,"Region V - Midwest",null,"INDIANA","COLUMBUS","Detached/Semi-Detached",115644.03200000001,202377.05609999999,150168.50049999999,262794.87589999998,179502.80590000001,314129.91029999999,214120.8328,374711.45730000001,252685.97159999999,442200.45039999997,277224.52529999998,485142.9191,300338.42489999998,525592.24360000005]
[5,"Region V - Midwest",null,"INDIANA","COLUMBUS","Row House",96733.772500000006,169284.10190000001,128768.77159999999,225345.3504,158517.4039,277405.45679999999,199197.65220000001,348595.89120000001,240810.72380000001,421418.76669999998,265871.9498,465275.91220000002,289329.60920000001,506326.8161]
[5,"Region V - Midwest",null,"INDIANA","COLUMBUS","Walkup",89118.895699999994,155958.06760000001,123056.6845,215349.19779999999,156021.73879999999,273038.0429,203632.43470000001,356356.76079999999,253628.1594,443849.27899999998,285369.09860000003,499395.92249999999,316621.53210000001,554087.68130000005]
[5,"Region V - Midwest",null,"INDIANA","COLUMBUS","Elevator",99700.595100000006,159520.95449999999,139580.83309999999,223329.3363,179461.07120000001,287137.7181,239281.42809999999,382850.29080000002,299101.78519999998,478562.86349999998,338982.0233,542371.24529999995,378862.26120000001,606179.62710000004]
[5,"Region V - Midwest",null,"INDIANA","EVANSVILLE","Detached/Semi-Detached",116292.3318,203511.58069999999,151027.17679999999,264297.55949999997,180543.89120000001,315951.80949999997,215383.08910000001,376920.40590000001,254189.9872,444832.47759999998,278880.71490000002,488041.25109999999,302143.61080000002,528751.31889999995]
[5,"Region V - Midwest",null,"INDIANA","EVANSVILLE","Row House",97185.066200000001,170073.8659,129404.533,226457.93280000001,159339.89009999999,278844.8077,200304.45790000001,350532.80129999999,242191.03829999999,423834.31689999998,267409.88299999997,467967.29519999999,291020.11940000003,509285.20899999997]
[5,"Region V - Midwest",null,"INDIANA","EVANSVILLE","Walkup",89476.411300000007,156583.71979999999,123539.39599999999,216193.9431,156619.51370000001,274084.14899999998,204383.6703,357671.42300000001,254557.69990000001,445475.97470000002,286400.951,501201.6643,317750.60800000001,556063.56409999996]
[5,"Region V - Midwest",null,"INDIANA","EVANSVILLE","Elevator",100257.47289999999,160411.95910000001,140360.462,224576.74249999999,180463.45120000001,288741.52610000002,240617.93479999999,384988.70150000002,300772.41859999998,481235.87699999998,340875.40779999999,545400.66040000005,380978.39689999999,609565.44409999996]
[5,"Region V - Midwest",null,"INDIANA","FORT WAYNE","Detached/Semi-Detached",116388.7548,203680.321,151222.36379999999,264639.13660000003,180838.20550000001,316466.85950000002,215818.94070000001,377683.14620000002,254764.26759999999,445837.46840000001,279536.19809999998,489188.34669999999,302899.09999999998,530073.42480000004]
[5,"Region V - Midwest",null,"INDIANA","FORT WAYNE","Row House",96887.429499999998,169553.00169999999,129153.8927,226019.31219999999,159197.00889999999,278594.76569999999,200429.41020000001,350751.46789999999,242517.91800000001,424406.35639999999,267828.85440000001,468700.4952,291546.25839999999,510205.9522]
[5,"Region V - Midwest",null,"INDIANA","FORT WAYNE","Walkup",88960.032999999996,155680.05790000001,122780.84639999999,214866.48120000001,155598.52729999999,272297.4227,202930.7604,355128.83059999999,252722.55439999999,442264.47029999999,284277.8665,497486.26640000002,315329.40720000002,551826.46270000003]
[5,"Region V - Midwest",null,"INDIANA","FORT WAYNE","Elevator",100332.10830000001,160531.3757,140464.9516,224743.9259,180597.79490000001,288956.47610000003,240797.05979999999,385275.3015,300996.3248,481594.12689999997,341129.16810000001,545806.67720000003,381262.01140000002,610019.22739999997]
[5,"Region V - Midwest",null,"INDIANA","GARY","Detached/Semi-Detached",134755.45250000001,235822.04190000001,175245.5134,306679.64850000001,209705.11379999999,366983.94919999997,250462.86009999999,438310.00530000002,295796.23940000002,517643.41899999999,324615.78629999998,568077.62589999998,351849.53090000001,615736.67909999995]
[5,"Region V - Midwest",null,"INDIANA","GARY","Row House",111314.25019999999,194799.93780000001,148718.76430000001,260257.8376,183691.95740000001,321460.92550000001,231964.33290000001,405937.58260000002,281075.87910000002,491882.78830000001,310543.32199999999,543450.81350000005,338203.18550000002,591855.57460000005]
[5,"Region V - Midwest",null,"INDIANA","GARY","Walkup",101651.63619999999,177890.36350000001,140192.88870000001,245337.55530000001,177528.35569999999,310674.6225,231254.58350000001,404695.52100000001,287937.25329999998,503890.19319999998,323755.32740000001,566571.82299999997,358967.85810000001,628193.75179999997]
[5,"Region V - Midwest",null,"INDIANA","GARY","Elevator",116145.6251,185833.00289999999,162603.8751,260166.204,209062.1251,334499.40509999997,278749.5001,445999.20679999999,348436.8751,557499.00859999994,394895.1251,631832.20959999994,441353.37520000001,706165.41079999995]
[5,"Region V - Midwest",null,"INDIANA","INDIANAPOLIS","Detached/Semi-Detached",118837.30409999999,207965.28210000001,154364.2683,270137.46950000001,184561.0502,322981.83789999998,220214.15849999999,385374.77740000002,259918.87330000001,454858.0282,285177.69260000001,499060.9621,308986.56709999999,540726.49230000004]
[5,"Region V - Midwest",null,"INDIANA","INDIANAPOLIS","Row House",99139.048899999994,173493.33549999999,132072.8836,231127.54629999999,162701.25599999999,284727.19799999997,204669.1784,358171.06209999998,247548.82320000001,433210.44050000003,273352.0931,478366.16279999999,297519.05040000001,520658.3382]
[5,"Region V - Midwest",null,"INDIANA","INDIANAPOLIS","Walkup",91164.653999999995,159538.1446,125849.50569999999,220236.63500000001,159521.09220000001,279161.91139999998,208115.0496,364201.33689999999,259193.41209999999,453588.47100000002,291589.8786,510282.28759999998,323477.4852,566085.59909999999]
[5,"Region V - Midwest",null,"INDIANA","INDIANAPOLIS","Elevator",102447.65300000001,163916.24729999999,143426.71419999999,229482.7463,184405.77540000001,295049.2451,245874.36730000001,393398.99359999999,307342.95919999998,491748.74200000003,348322.02039999998,557315.24089999998,389301.08159999998,622881.73990000004]
[5,"Region V - Midwest",null,"INDIANA","KOKOMO","Detached/Semi-Detached",115092.1629,201411.28520000001,149505.02129999999,261633.7873,178756.04740000001,312823.08289999998,213294.4431,373265.27539999998,251756.25450000001,440573.44540000003,276223.83840000001,483391.71730000002,299288.74959999998,523755.31170000002]
[5,"Region V - Midwest",null,"INDIANA","KOKOMO","Row House",95984.847299999994,167973.4829,127882.3775,223794.1606,157552.04629999999,275716.08110000001,198215.8119,346877.67080000002,239757.30549999999,419575.28470000002,264753.00650000002,463317.76130000001,288165.25819999998,504289.20169999998]
[5,"Region V - Midwest",null,"INDIANA","KOKOMO","Walkup",88245.006200000003,154428.76089999999,121815.429,213177.0007,154402.9846,270205.223,201428.29819999999,352499.52179999999,250863.4847,439011.09820000001,282214.17389999999,493874.80430000002,313071.26890000002,547874.72050000005]
[5,"Region V - Midwest",null,"INDIANA","KOKOMO","Elevator",99218.359299999996,158749.37729999999,138905.70310000001,222249.12820000001,178593.04680000001,285748.87910000002,238124.06229999999,380998.50550000003,297655.07799999998,476248.13189999998,337342.42170000001,539747.88269999996,377029.76549999998,603247.63370000001]
[5,"Region V - Midwest",null,"INDIANA","LAFAYETTE","Detached/Semi-Detached",116292.3318,203511.58069999999,151027.17679999999,264297.55949999997,180543.89120000001,315951.80949999997,215383.08910000001,376920.40590000001,254189.9872,444832.47759999998,278880.71490000002,488041.25109999999,302143.61080000002,528751.31889999995]
[5,"Region V - Midwest",null,"INDIANA","LAFAYETTE","Row House",97185.066200000001,170073.8659,129404.533,226457.93280000001,159339.89009999999,278844.8077,200304.45790000001,350532.80129999999,242191.03829999999,423834.31689999998,267409.88299999997,467967.29519999999,291020.11940000003,509285.20899999997]
[5,"Region V - Midwest",null,"INDIANA","LAFAYETTE","Walkup",89476.411300000007,156583.71979999999,123539.39599999999,216193.9431,156619.51370000001,274084.14899999998,204383.6703,357671.42300000001,254557.69990000001,445475.97470000002,286400.951,501201.6643,317750.60800000001,556063.56409999996]
[5,"Region V - Midwest",null,"INDIANA","LAFAYETTE","Elevator",100257.47289999999,160411.95910000001,140360.462,224576.74249999999,180463.45120000001,288741.52610000002,240617.93479999999,384988.70150000002,300772.41859999998,481235.87699999998,340875.40779999999,545400.66040000005,380978.39689999999,609565.44409999996]
[5,"Region V - Midwest",null,"INDIANA","MUNCIE","Detached/Semi-Detached",113747.3558,199057.8726,147690.0802,258457.64050000001,176526.72579999999,308921.77029999997,210552.01209999999,368466.02120000002,248461.09220000001,434806.91129999998,272583.72739999997,477021.52279999998,295300.64380000002,516776.12680000003]
[5,"Region V - Midwest",null,"INDIANA","MUNCIE","Row House",95231.080900000001,166654.3916,126736.1787,221788.31270000001,155978.51930000001,272962.40889999998,195939.73079999999,342894.52899999998,236833.245,414458.1789,261467.66380000001,457568.41149999999,284521.17830000003,497912.06209999998]
[5,"Region V - Midwest",null,"INDIANA","MUNCIE","Walkup",87788.166400000002,153629.29120000001,121229.28350000001,212151.24619999999,153717.93160000001,269006.38020000001,200652.28649999999,351141.5013,249921.98209999999,437363.46870000003,281212.01730000001,492121.03039999999,312023.7242,546041.51729999995]
[5,"Region V - Midwest",null,"INDIANA","MUNCIE","Elevator",98067.289399999994,156907.66529999999,137294.20499999999,219670.73139999999,176521.1208,282433.79759999999,235361.4944,376578.39669999998,294201.86800000002,470722.99589999998,333428.78379999998,533486.06200000003,372655.69949999999,596249.12820000004]
[5,"Region V - Midwest",null,"INDIANA","SOUTH BEND","Detached/Semi-Detached",117637.1352,205864.98670000001,152842.1128,267473.6973,182773.2064,319853.11119999998,218125.51250000001,381719.64689999999,257485.14060000001,450598.99609999999,282520.8162,494411.42830000003,306131.7058,535730.48510000005]
[5,"Region V - Midwest",null,"INDIANA","SOUTH BEND","Row House",97938.830100000006,171392.95250000001,130550.72809999999,228463.77410000001,160913.41219999999,281598.47139999998,202580.53229999999,354515.93160000001,245115.09049999999,428951.40830000001,270695.21659999999,473716.62900000002,294664.18910000002,515662.33100000001]
[5,"Region V - Midwest",null,"INDIANA","SOUTH BEND","Walkup",89933.248999999996,157383.18580000001,124125.5386,217219.69260000001,157304.5632,275282.98550000001,205159.67749999999,359029.43560000003,255499.19690000001,447123.59450000001,287403.10149999999,502955.4276,318798.14600000001,557896.75549999997]
[5,"Region V - Midwest",null,"INDIANA","SOUTH BEND","Elevator",101408.5396,162253.66570000001,141971.9553,227155.13200000001,182535.37109999999,292056.5981,243380.49479999999,389408.79759999999,304225.61859999999,486760.99699999997,344789.0343,551662.46310000005,385352.45010000002,616563.92949999997]
[5,"Region V - Midwest",null,"INDIANA","TERRE HAUTE","Detached/Semi-Detached",116388.7548,203680.321,151222.36379999999,264639.13660000003,180838.20550000001,316466.85950000002,215818.94070000001,377683.14620000002,254764.26759999999,445837.46840000001,279536.19809999998,489188.34669999999,302899.09999999998,530073.42480000004]
[5,"Region V - Midwest",null,"INDIANA","TERRE HAUTE","Row House",96887.429499999998,169553.00169999999,129153.8927,226019.31219999999,159197.00889999999,278594.76569999999,200429.41020000001,350751.46789999999,242517.91800000001,424406.35639999999,267828.85440000001,468700.4952,291546.25839999999,510205.9522]
[5,"Region V - Midwest",null,"INDIANA","TERRE HAUTE","Walkup",88960.032999999996,155680.05790000001,122780.84639999999,214866.48120000001,155598.52729999999,272297.4227,202930.7604,355128.83059999999,252722.55439999999,442264.47029999999,284277.8665,497486.26640000002,315329.40720000002,551826.46270000003]
[5,"Region V - Midwest",null,"INDIANA","TERRE HAUTE","Elevator",100332.10830000001,160531.3757,140464.9516,224743.9259,180597.79490000001,288956.47610000003,240797.05979999999,385275.3015,300996.3248,481594.12689999997,341129.16810000001,545806.67720000003,381262.01140000002,610019.22739999997]
[5,"Region V - Midwest",null,"MICHIGAN","ANN ARBOR","Detached/Semi-Detached",127575.98149999999,223257.9676,165702.5307,289979.42869999999,198106.07990000001,346685.6398,236360.18859999999,413630.33010000002,278965.01610000001,488188.7782,306070.05469999998,535622.59569999995,331614.84629999998,580325.98100000003]
[5,"Region V - Midwest",null,"MICHIGAN","ANN ARBOR","Row House",106498.8649,186373.01360000001,141850.74789999999,248238.8088,174716.09899999999,305753.17320000002,219727.05910000001,384522.35340000002,265729.06180000002,465025.85820000002,293416.66249999998,513479.1593,319344.6029,558853.0551]
[5,"Region V - Midwest",null,"MICHIGAN","ANN ARBOR","Walkup",97977.177200000006,171460.06020000001,135262.36730000001,236709.14290000001,171463.36369999999,300060.88660000003,223717.49619999999,391505.61849999998,278629.9423,487602.39899999998,313466.56030000001,548566.48049999995,347758.69809999998,608577.72160000005]
[5,"Region V - Midwest",null,"MICHIGAN","ANN ARBOR","Elevator",109982.68459999999,175972.29800000001,153975.75839999999,246361.21720000001,197968.83230000001,316750.13630000001,263958.44300000003,422333.51510000002,329948.05379999999,527916.89379999996,373941.12760000001,598305.81299999997,417934.20140000002,668694.73230000003]
[5,"Region V - Midwest",null,"MICHIGAN","BATTLE CREEK","Detached/Semi-Detached",117637.1352,205864.98670000001,152842.1128,267473.6973,182773.2064,319853.11119999998,218125.51250000001,381719.64689999999,257485.14060000001,450598.99609999999,282520.8162,494411.42830000003,306131.7058,535730.48510000005]
[5,"Region V - Midwest",null,"MICHIGAN","BATTLE CREEK","Row House",97938.830100000006,171392.95250000001,130550.72809999999,228463.77410000001,160913.41219999999,281598.47139999998,202580.53229999999,354515.93160000001,245115.09049999999,428951.40830000001,270695.21659999999,473716.62900000002,294664.18910000002,515662.33100000001]
[5,"Region V - Midwest",null,"MICHIGAN","BATTLE CREEK","Walkup",89933.248999999996,157383.18580000001,124125.5386,217219.69260000001,157304.5632,275282.98550000001,205159.67749999999,359029.43560000003,255499.19690000001,447123.59450000001,287403.10149999999,502955.4276,318798.14600000001,557896.75549999997]
[5,"Region V - Midwest",null,"MICHIGAN","BATTLE CREEK","Elevator",101408.5396,162253.66570000001,141971.9553,227155.13200000001,182535.37109999999,292056.5981,243380.49479999999,389408.79759999999,304225.61859999999,486760.99699999997,344789.0343,551662.46310000005,385352.45010000002,616563.92949999997]
[5,"Region V - Midwest",null,"MICHIGAN","BAY CITY","Detached/Semi-Detached",119533.8115,209184.17019999999,155320.533,271810.93280000001,185749.28640000001,325061.2512,221694.33309999999,387965.08299999998,261710.02009999999,457992.53519999998,287161.61410000001,502532.8247,311169.48670000001,544546.60179999995]
[5,"Region V - Midwest",null,"MICHIGAN","BAY CITY","Row House",99441.521599999993,174022.66279999999,132583.321,232020.8118,163452.29680000001,286041.51929999999,205838.45370000001,360217.29389999999,249092.5692,435911.99609999999,275099.50270000001,481424.12969999999,299472.6201,524077.08510000003]
[5,"Region V - Midwest",null,"MICHIGAN","BAY CITY","Walkup",91263.978400000007,159711.96220000001,125952.93949999999,220417.64420000001,159608.37040000001,279314.6482,208139.82569999999,364244.69510000001,259205.37419999999,453609.40480000002,291560.1827,510230.31969999999,323395.95390000002,565942.91949999996]
[5,"Region V - Midwest",null,"MICHIGAN","BAY CITY","Elevator",103041.8452,164866.95490000001,144258.5834,230813.73680000001,185475.32139999999,296760.51870000002,247300.42860000001,395680.69160000002,309125.53570000001,494600.86450000003,350342.27380000002,560547.64639999997,391559.01189999998,626494.42830000003]
[5,"Region V - Midwest",null,"MICHIGAN","DETROIT","Detached/Semi-Detached",129376.23480000001,226408.41080000001,167985.764,293975.087,200787.8456,351378.72979999997,239493.15770000001,419113.02590000001,282615.6152,494577.32640000002,310055.36930000002,542596.89639999997,335897.13819999999,587819.99190000002]
[5,"Region V - Midwest",null,"MICHIGAN","DETROIT","Row House",108299.19319999999,189523.58809999999,144133.98120000001,252234.46710000001,177397.86470000001,310446.26319999999,222860.0281,390005.0491,269379.66080000001,471414.40649999998,297401.97710000002,520453.46,323626.89480000001,566347.06590000005]
[5,"Region V - Midwest",null,"MICHIGAN","DETROIT","Walkup",99824.284799999994,174692.49840000001,137848.31789999999,241234.5564,174788.1574,305879.27549999999,228150.55439999999,399263.47029999999,284171.26500000001,497299.71380000003,319746.72600000002,559556.77060000005,354777.70689999999,620860.98699999996]
[5,"Region V - Midwest",null,"MICHIGAN","DETROIT","Elevator",111541.35490000001,178466.17050000001,156157.89679999999,249852.63870000001,200774.4388,321239.10680000001,267699.25170000002,428318.80910000001,334624.06469999999,535398.51139999996,379240.6066,606784.97959999996,423857.14860000001,678171.44779999997]
[5,"Region V - Midwest",null,"MICHIGAN","FLINT","Detached/Semi-Detached",123230.7447,215653.80309999999,160082.1911,280143.8345,191407.13750000001,334962.49050000001,228396.12899999999,399693.22570000001,269585.50589999999,471774.63520000002,295787.73450000002,517628.5355,320489.56819999998,560856.74439999997]
[5,"Region V - Midwest",null,"MICHIGAN","FLINT","Row House",102744.5451,179802.95379999999,136899.15179999999,239573.51569999999,168672.9523,295177.66649999999,212229.35019999999,371401.3628,256720.65419999999,449261.14480000001,283489.11139999999,496105.94500000001,308563.35139999999,539985.86490000004]
[5,"Region V - Midwest",null,"MICHIGAN","FLINT","Walkup",94441.819000000003,165273.1832,130366.2962,228141.0183,165236.97779999999,289164.71120000002,215553.041,377217.82169999997,268452.88530000002,469792.54920000001,301997.44219999999,528495.52379999997,335012.78460000001,586272.37320000003]
[5,"Region V - Midwest",null,"MICHIGAN","FLINT","Elevator",106233.82429999999,169974.12160000001,148727.3541,237963.77009999999,191220.88389999999,305953.41869999998,254961.17850000001,407937.89159999997,318701.473,509922.36450000003,361195.00280000002,577912.01300000004,403688.53259999998,645901.66170000006]
[5,"Region V - Midwest",null,"MICHIGAN","GRAND RAPIDS","Detached/Semi-Detached",116940.6277,204646.0986,151885.8481,265800.2341,181584.97020000001,317773.69780000002,216645.33790000001,379129.34129999997,255693.9938,447464.48910000001,280536.89480000001,490939.56579999998,303948.78600000002,531910.37549999997]
[5,"Region V - Midwest",null,"MICHIGAN","GRAND RAPIDS","Row House",97636.357300000003,170863.62530000001,130040.29059999999,227570.5086,160162.37150000001,280284.15000000002,201411.25700000001,352469.6998,243571.34450000001,426249.85279999999,268947.80690000003,470658.66200000001,292710.61949999997,512243.58419999998]
[5,"Region V - Midwest",null,"MICHIGAN","GRAND RAPIDS","Walkup",89833.924700000003,157209.3682,124022.1047,217038.68340000001,157217.28510000001,275130.2488,205134.9014,358986.07740000001,255487.2347,447102.66070000001,287432.79739999998,503007.39539999998,318879.67719999998,558039.43519999995]
[5,"Region V - Midwest",null,"MICHIGAN","GRAND RAPIDS","Elevator",100814.34729999999,161302.95819999999,141140.08619999999,225824.14139999999,181465.82519999999,290345.3247,241954.43359999999,387127.09950000001,302443.04200000002,483908.87449999998,342768.78090000001,548430.05759999994,383094.51990000001,612951.24100000004]
[5,"Region V - Midwest",null,"MICHIGAN","JACKSON","Detached/Semi-Detached",118333.64260000001,207083.87469999999,153798.3775,269147.1606,183961.44260000001,321932.5246,219605.68719999999,384309.95240000001,259276.2874,453733.50290000002,284504.73759999999,497883.29080000002,308314.62550000002,539550.59459999995]
[5,"Region V - Midwest",null,"MICHIGAN","JACKSON","Row House",98241.302800000005,171922.27979999999,131061.1655,229357.03959999999,161664.45300000001,282912.79269999999,203749.8077,356562.16340000002,246658.8365,431652.96389999997,272442.6262,476774.59590000001,296617.75880000001,519081.07789999997]
[5,"Region V - Midwest",null,"MICHIGAN","JACKSON","Walkup",90032.573300000004,157557.00330000001,124228.9725,217400.70180000001,157391.8413,275435.72220000002,205184.45370000001,359072.79389999999,255511.15900000001,447144.52830000001,287373.40549999999,502903.4596,318716.61479999998,557754.07590000005]
[5,"Region V - Midwest",null,"MICHIGAN","JACKSON","Elevator",102002.7317,163204.3732,142803.82440000001,228486.12239999999,183604.91699999999,293767.87160000001,244806.55609999999,391690.49550000002,306008.19510000001,489613.11940000003,346809.28779999999,554894.86869999999,387610.38040000002,620176.61789999995]
[5,"Region V - Midwest",null,"MICHIGAN","KALAMAZOO","Detached/Semi-Detached",119533.8115,209184.17019999999,155320.533,271810.93280000001,185749.28640000001,325061.2512,221694.33309999999,387965.08299999998,261710.02009999999,457992.53519999998,287161.61410000001,502532.8247,311169.48670000001,544546.60179999995]
[5,"Region V - Midwest",null,"MICHIGAN","KALAMAZOO","Row House",99441.521599999993,174022.66279999999,132583.321,232020.8118,163452.29680000001,286041.51929999999,205838.45370000001,360217.29389999999,249092.5692,435911.99609999999,275099.50270000001,481424.12969999999,299472.6201,524077.08510000003]
[5,"Region V - Midwest",null,"MICHIGAN","KALAMAZOO","Walkup",91263.978400000007,159711.96220000001,125952.93949999999,220417.64420000001,159608.37040000001,279314.6482,208139.82569999999,364244.69510000001,259205.37419999999,453609.40480000002,291560.1827,510230.31969999999,323395.95390000002,565942.91949999996]
[5,"Region V - Midwest",null,"MICHIGAN","KALAMAZOO","Elevator",103041.8452,164866.95490000001,144258.5834,230813.73680000001,185475.32139999999,296760.51870000002,247300.42860000001,395680.69160000002,309125.53570000001,494600.86450000003,350342.27380000002,560547.64639999997,391559.01189999998,626494.42830000003]
[5,"Region V - Midwest",null,"MICHIGAN","LANSING","Detached/Semi-Detached",119437.39200000001,209015.43609999999,155125.35070000001,271469.36359999998,185454.9774,324546.21049999999,221258.4877,387202.35350000003,261135.74679999999,456987.55699999997,286506.13880000002,501385.74280000001,310414.0062,543224.51080000005]
[5,"Region V - Midwest",null,"MICHIGAN","LANSING","Row House",99739.161900000006,174543.53330000001,132833.96590000001,232459.44029999999,163595.1832,286291.57059999998,205713.50760000001,359998.63829999999,248765.69680000001,435339.9693,274680.5392,480690.9436,298946.48959999997,523156.3567]
[5,"Region V - Midwest",null,"MICHIGAN","LANSING","Walkup",91780.360199999996,160615.63039999999,126711.49430000001,221745.1151,160629.36350000001,281101.386,209592.7445,366787.3028,261040.5307,456820.92859999998,293683.27970000001,513945.73940000002,325817.16879999998,570180.0453]
[5,"Region V - Midwest",null,"MICHIGAN","LANSING","Elevator",102967.213,164747.54319999999,144154.0981,230646.56039999999,185340.98319999999,296545.57760000002,247121.31099999999,395394.10350000003,308901.63870000001,494242.62939999998,350088.52389999997,560141.64659999998,391275.40909999999,626040.66390000004]
[5,"Region V - Midwest",null,"MICHIGAN","MUSKEGON","Detached/Semi-Detached",116388.7548,203680.321,151222.36379999999,264639.13660000003,180838.20550000001,316466.85950000002,215818.94070000001,377683.14620000002,254764.26759999999,445837.46840000001,279536.19809999998,489188.34669999999,302899.09999999998,530073.42480000004]
[5,"Region V - Midwest",null,"MICHIGAN","MUSKEGON","Row House",96887.429499999998,169553.00169999999,129153.8927,226019.31219999999,159197.00889999999,278594.76569999999,200429.41020000001,350751.46789999999,242517.91800000001,424406.35639999999,267828.85440000001,468700.4952,291546.25839999999,510205.9522]
[5,"Region V - Midwest",null,"MICHIGAN","MUSKEGON","Walkup",88960.032999999996,155680.05790000001,122780.84639999999,214866.48120000001,155598.52729999999,272297.4227,202930.7604,355128.83059999999,252722.55439999999,442264.47029999999,284277.8665,497486.26640000002,315329.40720000002,551826.46270000003]
[5,"Region V - Midwest",null,"MICHIGAN","MUSKEGON","Elevator",100332.10830000001,160531.3757,140464.9516,224743.9259,180597.79490000001,288956.47610000003,240797.05979999999,385275.3015,300996.3248,481594.12689999997,341129.16810000001,545806.67720000003,381262.01140000002,610019.22739999997]
[5,"Region V - Midwest",null,"MICHIGAN","SAGINAW","Detached/Semi-Detached",118237.2196,206915.13440000001,153603.1906,268805.5834,183667.12830000001,321417.47450000001,219169.83549999999,383547.2121,258702.00700000001,452728.5122,283849.25449999998,496736.19520000002,307559.13640000002,538228.48869999999]
[5,"Region V - Midwest",null,"MICHIGAN","SAGINAW","Row House",98538.939499999993,172443.1441,131311.80590000001,229795.66020000001,161807.33410000001,283162.8346,203624.8553,356343.49680000002,246331.95680000001,431080.92440000002,272023.65480000002,476041.3959,296091.61979999999,518160.3346]
[5,"Region V - Midwest",null,"MICHIGAN","SAGINAW","Walkup",90548.951499999996,158460.66519999999,124987.5221,218728.16380000001,158412.82769999999,277222.4485,206637.36360000001,361615.38620000001,257346.30439999999,450356.03279999999,289496.4901,506618.85759999999,321137.81559999997,561991.17729999998]
[5,"Region V - Midwest",null,"MICHIGAN","SAGINAW","Elevator",101928.0963,163084.9566,142699.33480000001,228318.93909999999,183470.57329999999,293552.9216,244627.43109999999,391403.89559999999,305784.28889999999,489254.86949999997,346555.52730000002,554488.85199999996,387326.7659,619722.83459999994]
[5,"Region V - Midwest",null,"MICHIGAN","TRAVERSE CITY","Detached/Semi-Detached",114684.921,200698.61180000001,149134.31280000001,260985.04749999999,178450.7487,312288.81030000001,213121.81709999999,372963.17989999999,251687.94200000001,440453.8983,276206.35879999999,483361.12770000001,299372.28860000003,523901.505]
[5,"Region V - Midwest",null,"MICHIGAN","TRAVERSE CITY","Row House",94789.460900000005,165881.55669999999,126620.0145,221585.02540000001,156372.35680000001,273651.62439999997,197421.3872,345487.4277,239194.19149999999,418589.83490000002,264262.50329999998,462459.38069999998,287790.0969,503632.66960000002]
[5,"Region V - Midwest",null,"MICHIGAN","TRAVERSE CITY","Walkup",86596.543600000005,151543.95129999999,119436.3409,209013.59669999999,151252.74059999999,264692.29609999998,197044.78339999999,344828.37099999998,245346.07519999999,429355.63179999997,275874.60379999998,482780.55650000001,305889.18369999999,535306.07149999996]
[5,"Region V - Midwest",null,"MICHIGAN","TRAVERSE CITY","Elevator",98848.070300000007,158156.9149,138387.2984,221419.6807,177926.52650000001,284682.44660000002,237235.36869999999,379576.5956,296544.21090000001,474470.74440000003,336083.43900000001,537733.51029999997,375622.66710000002,600996.27619999996]
[5,"Region V - Midwest",null,"MINNESOTA","BRAINERD","Detached/Semi-Detached",123879.04059999999,216788.321,160940.86240000001,281646.50910000002,192448.21650000001,336784.37880000001,229658.37779999999,401902.16110000003,271089.51240000001,474406.64679999999,297443.91440000001,520526.85029999999,322294.74339999998,564015.80090000003]
[5,"Region V - Midwest",null,"MINNESOTA","BRAINERD","Row House",103195.8361,180592.71309999999,137534.90950000001,240686.09160000001,169495.43359999999,296617.00880000001,213336.14929999999,373338.26130000001,258100.96040000001,451676.68070000003,285027.03539999999,498797.31199999998,310253.85149999999,542944.24010000005]
[5,"Region V - Midwest",null,"MINNESOTA","BRAINERD","Walkup",94799.332299999995,165898.83170000001,130849.0049,228985.7586,165834.74909999999,290210.81109999999,216304.2721,378532.47610000003,269382.42019999999,471419.2353,303029.28840000002,530301.25490000006,336141.85389999999,588248.24419999996]
[5,"Region V - Midwest",null,"MINNESOTA","BRAINERD","Elevator",106790.6988,170865.1207,149506.97829999999,239211.16889999999,192223.2579,307557.21710000001,256297.67720000001,410076.28960000002,320372.09649999999,512595.36200000002,363088.37609999999,580941.41020000004,405804.6556,649287.45860000001]
[5,"Region V - Midwest",null,"MINNESOTA","DULUTH","Detached/Semi-Detached",133769.67180000001,234096.92559999999,173703.68229999999,303981.44390000001,207633.92749999999,363359.37310000003,247675.1219,433431.4633,292282.24040000001,511493.92080000002,320665.40340000001,561164.45589999994,347400.13089999999,607950.22900000005]
[5,"Region V - Midwest",null,"MINNESOTA","DULUTH","Row House",111904.68580000001,195833.20009999999,148960.24489999999,260680.42860000001,183369.55559999999,320896.72230000002,230420.1937,403235.33899999998,278551.48460000003,487465.0981,307538.9877,538193.22829999996,334671.18729999999,585674.57779999997]
[5,"Region V - Midwest",null,"MINNESOTA","DULUTH","Walkup",103101.446,180427.53049999999,142365.10329999999,249138.9308,180504.03640000001,315882.0637,235588.53709999999,412279.93979999999,293430.72720000002,513503.77269999997,330154.27710000001,577769.98490000004,366312.99239999999,641047.73659999995]
[5,"Region V - Midwest",null,"MINNESOTA","DULUTH","Elevator",115327.52310000001,184524.03969999999,161458.53229999999,258333.6556,207589.54149999999,332143.27149999997,276786.05540000001,442857.69520000002,345982.56929999997,553572.11919999996,392113.5785,627381.73490000004,438244.58779999998,701191.35089999996]
[5,"Region V - Midwest",null,"MINNESOTA","MANKATO","Detached/Semi-Detached",128824.3619,225442.63329999999,167322.27970000001,292813.98940000002,200041.0808,350071.89150000003,238666.7605,417666.8309,281685.88900000002,492950.30579999997,309054.6728,540845.67720000003,334847.4522,585983.04130000004]
[5,"Region V - Midwest",null,"MINNESOTA","MANKATO","Row House",107550.2654,188212.9644,143247.58319999999,250683.27069999999,176432.50219999999,308756.87880000001,221878.18119999999,388286.81719999999,268326.23440000002,469570.91019999998,296283.0246,518495.29310000001,322462.53370000003,564309.43400000001]
[5,"Region V - Midwest",null,"MINNESOTA","MANKATO","Walkup",98950.393200000006,173163.18799999999,136607.05960000001,239062.3542,173169.39970000001,303046.44939999998,225946.41339999999,395406.22350000002,281406.58470000001,492461.5233,316591.79519999999,554035.64159999997,351227.43680000002,614648.01450000005]
[5,"Region V - Midwest",null,"MINNESOTA","MANKATO","Elevator",111059.1158,177694.58799999999,155482.76209999999,248772.42319999999,199906.40849999999,319850.25829999999,266541.87800000003,426467.0111,333177.34749999997,533083.76399999997,377600.9938,604161.59900000005,422024.64010000002,675239.43429999996]
[5,"Region V - Midwest",null,"MINNESOTA","MINNEAPOLIS","Detached/Semi-Detached",139363.28479999999,243885.74849999999,180943.76509999999,316651.58899999998,216267.86379999999,378468.76179999998,257945.74460000001,451405.05300000001,304382.61300000001,532669.57270000002,333932.3297,584381.57700000005,361758.00180000003,633076.50320000004]
[5,"Region V - Midwest",null,"MINNESOTA","MINNEAPOLIS","Row House",116710.40429999999,204243.20759999999,155308.67319999999,271790.17820000002,191129.101,334475.92690000002,240069.0178,420120.78110000002,290157.05560000002,507774.84730000002,320332.89049999998,560582.55819999997,348570.3579,609998.12639999995]
[5,"Region V - Midwest",null,"MINNESOTA","MINNEAPOLIS","Walkup",107610.0197,188317.5344,148605.86610000001,260060.26560000001,188436.4577,329763.80089999997,245981.9093,430468.34120000002,306384.42660000001,536172.74659999995,344748.63030000002,603310.103,382527.64500000002,669423.37879999995]
[5,"Region V - Midwest",null,"MINNESOTA","MINNEAPOLIS","Elevator",120152.81110000001,192244.50049999999,168213.93539999999,269142.30070000002,216275.05979999999,346040.10090000002,288366.7464,461386.80119999999,360458.43310000002,576733.50159999996,408519.5575,653631.30169999995,456580.68190000003,730529.10199999996]
[5,"Region V - Midwest",null,"MINNESOTA","ROCHESTER","Detached/Semi-Detached",132521.29139999999,231912.26010000001,172083.9333,301146.88319999998,205698.92660000001,359973.12150000001,245368.55009999999,429394.96269999997,289561.3676,506732.39319999999,317680.78529999999,555941.37419999996,344167.52500000002,602293.16879999998]
[5,"Region V - Midwest",null,"MINNESOTA","ROCHESTER","Row House",110853.2853,193993.24919999999,147563.40960000001,258235.96669999999,181653.15239999999,317893.01679999998,228269.07149999999,399470.87520000001,275954.31209999998,482920.04619999998,304672.62540000002,533177.09450000001,331553.25640000001,580218.19889999996]
[5,"Region V - Midwest",null,"MINNESOTA","ROCHESTER","Walkup",102128.2301,178724.40270000001,141020.41099999999,246785.71950000001,178798.00049999999,312896.50089999998,233359.61979999999,408379.33470000001,290654.08480000001,508644.64840000001,327029.04220000003,572300.82380000001,362844.2536,634977.44380000001]
[5,"Region V - Midwest",null,"MINNESOTA","ROCHESTER","Elevator",114251.09179999999,182801.74969999999,159951.52859999999,255922.44949999999,205651.96530000001,329043.1495,274202.62040000001,438724.19929999998,342753.27559999999,548405.24899999995,388453.71230000001,621525.94889999996,434154.14909999998,694646.64879999997]
[5,"Region V - Midwest",null,"MINNESOTA","SAINT PAUL","Detached/Semi-Detached",139411.4964,243970.11859999999,181041.35860000001,316822.3775,216415.02110000001,378726.2868,258163.6704,451786.42320000002,304669.75319999998,533172.06810000003,334260.07130000001,584955.12470000004,362135.7463,633737.55610000005]
[5,"Region V - Midwest",null,"MINNESOTA","SAINT PAUL","Row House",116561.586,203982.77549999999,155183.35310000001,271570.86790000001,191057.66039999999,334350.90580000001,240131.49400000001,420230.11440000002,290320.49550000002,508060.86709999997,320542.3762,560949.15819999995,348833.42749999999,610458.49809999997]
[5,"Region V - Midwest",null,"MINNESOTA","SAINT PAUL","Walkup",107351.8305,187865.7035,148226.5912,259396.53460000001,187925.9644,328870.43780000001,245255.45439999999,429197.04509999999,305466.85399999999,534566.99439999997,343687.08799999999,601452.40410000004,381317.04460000002,667304.82799999998]
[5,"Region V - Midwest",null,"MINNESOTA","SAINT PAUL","Elevator",120190.1287,192304.20879999999,168266.1802,269225.89230000001,216342.2317,346147.5759,288456.3089,461530.10129999998,360570.38620000001,576912.62650000001,408646.43770000001,653834.31000000006,456722.48920000001,730755.99360000005]
[5,"Region V - Midwest",null,"MINNESOTA","ST. CLOUD","Detached/Semi-Detached",130672.82670000001,228677.4466,169703.10639999999,296980.4363,202870.00380000001,355022.50650000002,242017.65530000001,423530.89679999999,285623.62829999998,499841.34950000001,313367.72899999999,548393.52579999994,339507.48859999998,594138.10510000004]
[5,"Region V - Midwest",null,"MINNESOTA","ST. CLOUD","Row House",109201.77529999999,191103.10690000001,145405.4964,254459.61869999999,179042.8273,313324.94780000002,225073.62640000001,393878.84620000003,272140.2733,476245.47810000001,300477.82500000001,525836.19380000001,327007.89510000002,572263.81640000001]
[5,"Region V - Midwest",null,"MINNESOTA","ST. CLOUD","Walkup",100539.3116,175943.7954,138813.7353,242924.0368,175983.70009999999,307971.47509999998,229653.01670000001,401892.77909999999,286030.33480000001,500553.0858,321810.41869999998,563168.23270000005,357035.84519999998,624812.7291]
[5,"Region V - Midwest",null,"MINNESOTA","ST. CLOUD","Elevator",112655.1038,180248.16880000001,157717.14540000001,252347.43640000001,202779.1869,324446.70390000002,270372.24920000002,432595.60519999999,337965.31150000001,540744.50650000002,383027.353,612843.77399999998,428089.3946,684943.04150000005]
[5,"Region V - Midwest",null,"OHIO","AKRON","Detached/Semi-Detached",121237.6453,212165.87940000001,157408.584,275465.02189999999,188136.74309999999,329239.30040000001,224391.45670000001,392685.04930000001,264786.34590000001,463376.1053,290491.4535,508360.04359999998,314696.29810000001,550718.52170000004]
[5,"Region V - Midwest",null,"OHIO","AKRON","Row House",101539.4901,177694.10769999999,135117.19930000001,236455.0986,166276.94889999999,290984.6605,208846.47649999999,365481.33399999997,252416.29579999999,441728.51760000002,278665.85389999999,487665.24430000002,303228.78149999998,530650.36750000005]
[5,"Region V - Midwest",null,"OHIO","AKRON","Walkup",93627.467900000003,163848.0687,129297.44500000001,226270.5287,163954.15710000001,286919.77480000001,214025.8026,374545.15470000001,266581.85330000002,466518.24339999998,299963.44540000003,524936.02949999995,332836.1776,582463.31070000003]
[5,"Region V - Midwest",null,"OHIO","AKRON","Elevator",104525.8832,167241.41570000001,146336.2365,234137.98190000001,188146.58979999999,301034.54810000001,250862.11979999999,401379.39760000003,313577.64970000001,501724.24699999997,355388.00290000002,568620.81319999998,397198.35629999998,635517.37950000004]
[5,"Region V - Midwest",null,"OHIO","CANTON","Detached/Semi-Detached",116844.20450000001,204477.3578,151690.6606,265458.65600000002,181290.65489999999,317258.64620000002,216209.48499999999,378366.59869999997,255119.71160000001,446459.4952,279881.40960000001,489792.46679999999,303193.29470000003,530588.26560000004]
[5,"Region V - Midwest",null,"OHIO","CANTON","Row House",97933.994900000005,171384.49110000001,130290.9317,228009.1306,160305.253,280534.19270000001,201286.30429999999,352251.03269999998,243244.46369999999,425677.81150000001,268528.83419999998,469925.45980000001,292184.47899999999,511322.8382]
[5,"Region V - Midwest",null,"OHIO","CANTON","Walkup",90350.304399999994,158113.03279999999,124780.65670000001,218366.14920000001,158238.2745,276916.9804,206587.81570000001,361528.67739999999,257322.38560000001,450314.17479999998,289555.88829999999,506722.80440000002,321300.88520000002,562276.54929999996]
[5,"Region V - Midwest",null,"OHIO","CANTON","Elevator",100739.7117,161183.54120000001,141035.59640000001,225656.95759999999,181331.4811,290130.37400000001,241775.30799999999,386840.4987,302219.13510000001,483550.62339999998,342515.01980000001,548024.03980000003,382810.9044,612497.45629999996]
[5,"Region V - Midwest",null,"OHIO","CINCINNATI","Detached/Semi-Detached",117037.05070000001,204814.8389,152081.03510000001,266141.8113,181879.28450000001,318288.74790000002,217081.18950000001,379892.08169999998,256268.27420000001,448469.48,281192.37790000002,492086.66139999998,304704.27519999997,533232.48140000005]
[5,"Region V - Midwest",null,"OHIO","CINCINNATI","Row House",97338.720600000001,170342.7611,129789.65029999999,227131.88800000001,160019.4903,280034.10800000001,201536.20929999999,352688.3664,243898.22409999999,426821.8922,269366.77830000001,471391.86210000003,293236.7586,513164.3273]
[5,"Region V - Midwest",null,"OHIO","CINCINNATI","Walkup",89317.546400000007,156305.70629999999,123263.55499999999,215711.22140000001,156196.29870000001,273343.52250000002,203681.9915,356443.48499999999,253652.08929999999,443891.15620000003,285309.71289999998,499291.9975,316458.47649999999,553802.33369999996]
[5,"Region V - Midwest",null,"OHIO","CINCINNATI","Elevator",100888.98269999999,161422.37479999999,141244.57579999999,225991.3247,181600.16889999999,290560.2746,242133.55859999999,387413.69959999999,302666.94829999999,484267.12449999998,343022.54129999998,548836.07429999998,383378.13449999999,613405.02430000005]
[5,"Region V - Midwest",null,"OHIO","CLEVELAND","Detached/Semi-Detached",123734.40609999999,216535.21059999999,160648.08189999999,281134.1434,192006.745,336011.80379999999,229004.60029999999,400758.05060000002,270228.09169999999,472899.1605,296460.68959999998,518806.20689999999,321161.5097,562032.64199999999]
[5,"Region V - Midwest",null,"OHIO","CLEVELAND","Row House",103642.29120000001,181374.00949999999,137910.86989999999,241344.02239999999,169709.75529999999,296992.07179999998,213148.72089999999,373010.26150000002,257610.64079999999,450818.6214,284398.57829999999,497697.51189999998,309464.64299999998,541563.12529999996]
[5,"Region V - Midwest",null,"OHIO","CLEVELAND","Walkup",95573.899699999994,167254.32449999999,131986.82939999999,230976.9515,167366.22880000001,292890.90039999998,218483.63699999999,382346.36479999998,272135.13829999999,476236.49190000002,306213.91529999999,535874.35179999995,339773.65509999997,594603.89650000003]
[5,"Region V - Midwest",null,"OHIO","CLEVELAND","Elevator",106678.7458,170685.9958,149350.24400000001,238960.3939,192021.74230000001,307234.79220000003,256028.98970000001,409646.38959999999,320036.23719999997,512057.98700000002,362707.73540000001,580332.38529999997,405379.23369999998,648606.78359999997]
[5,"Region V - Midwest",null,"OHIO","COLUMBUS","Detached/Semi-Detached",120733.98390000001,211284.47200000001,156842.6931,274474.71299999999,187537.1355,328189.98719999997,223782.98540000001,391620.2243,264143.76,462251.58,289818.49849999999,507182.37229999999,314024.3566,549542.62399999995]
[5,"Region V - Midwest",null,"OHIO","COLUMBUS","Row House",100641.74400000001,176123.052,134105.4811,234684.592,165240.1459,289170.25520000001,207927.1059,363872.43530000001,251526.30910000001,440171.04090000002,277756.38709999999,486073.67739999999,302327.48989999999,529073.10719999997]
[5,"Region V - Midwest",null,"OHIO","COLUMBUS","Walkup",92495.387100000007,161866.92739999999,127676.9117,223434.5955,161824.90609999999,283193.5857,211095.20670000001,369416.61170000001,262899.6004,460074.30060000002,295746.97230000002,517557.20159999997,328075.30709999998,574131.78740000003]
[5,"Region V - Midwest",null,"OHIO","COLUMBUS","Elevator",104080.96189999999,166529.54149999999,145713.34659999999,233141.35810000001,187345.73130000001,299753.17469999997,249794.30850000001,399670.8995,312242.88559999998,499588.62439999997,353875.27039999998,566200.44099999999,395507.65509999997,632812.25760000001]
[5,"Region V - Midwest",null,"OHIO","DAYTON","Detached/Semi-Detached",116988.83930000001,204730.4688,151983.44149999999,265971.02269999997,181732.12729999999,318031.22289999999,216863.26370000001,379510.71149999998,255981.13399999999,447966.98450000002,280864.63630000001,491513.11359999998,304326.5306,532571.42850000004]
[5,"Region V - Midwest",null,"OHIO","DAYTON","Row House",97487.539000000004,170603.19320000001,129914.97040000001,227351.19829999999,160090.93090000001,280159.12900000002,201473.73319999999,352579.0331,243734.7843,426535.8725,269157.29269999999,471025.26209999999,292973.68900000001,512703.9558]
[5,"Region V - Midwest",null,"OHIO","DAYTON","Walkup",89575.7356,156757.5373,123642.8299,216374.95240000001,156706.79190000001,274236.88569999998,204408.44639999999,357714.78120000003,254569.66200000001,445496.90850000002,286371.25510000001,501149.69640000002,317669.07679999998,555920.88450000004]
[5,"Region V - Midwest",null,"OHIO","DAYTON","Elevator",100851.66499999999,161362.66649999999,141192.33110000001,225907.73310000001,181532.99710000001,290452.79969999997,242043.99609999999,387270.3995,302554.9951,484087.99939999997,342895.66110000003,548633.06599999999,383236.3272,613178.13260000001]
[5,"Region V - Midwest",null,"OHIO","HAMILTON","Detached/Semi-Detached",113843.7787,199226.6128,147885.2671,258799.2176,176821.04010000001,309436.82030000002,210987.86369999999,369228.76150000002,249035.37270000001,435811.90210000001,273239.21059999999,478168.61839999998,296056.13299999997,518098.23269999999]
[5,"Region V - Midwest",null,"OHIO","HAMILTON","Row House",94933.444199999998,166133.52729999999,126485.5383,221349.69209999999,155835.63819999999,272712.36680000002,196064.68309999999,343113.19549999997,237160.12479999999,415030.21830000001,261886.63510000001,458301.6115,285047.3173,498832.8052]
[5,"Region V - Midwest",null,"OHIO","HAMILTON","Walkup",87271.788100000005,152725.6293,120470.73390000001,210823.78419999999,152696.94519999999,267219.65399999998,199199.37650000001,348598.90899999999,248086.83670000001,434151.96419999999,279088.93280000001,488405.6324,309602.5233,541804.41579999996]
[5,"Region V - Midwest",null,"OHIO","HAMILTON","Elevator",98141.924799999993,157027.08199999999,137398.69459999999,219837.9148,176655.46460000001,282648.7475,235540.6194,376864.99670000002,294425.77429999999,471081.24589999998,333682.5442,533892.07869999995,372939.31410000002,596702.91150000005]
[5,"Region V - Midwest",null,"OHIO","LIMA","Detached/Semi-Detached",110746.93,193807.12760000001,143884.6868,251798.20199999999,172057.11110000001,301099.94439999998,205330.3909,359328.18400000001,242376.75320000001,424159.31809999997,265941.52830000001,465397.67440000002,288163.48220000003,504286.09389999998]
[5,"Region V - Midwest",null,"OHIO","LIMA","Row House",92230.530199999994,161403.42790000001,122930.7853,215128.87419999999,151508.90460000001,265140.58299999998,190718.1096,333756.69179999997,230748.90609999999,403810.5857,254825.46470000001,445944.56319999998,277384.01669999998,485422.02909999999]
[5,"Region V - Midwest",null,"OHIO","LIMA","Walkup",84709.650099999999,148241.88769999999,116919.3607,204608.88130000001,148176.60219999999,259309.0539,193263.84729999999,338211.7329,240686.4332,421201.25809999998,270745.06189999997,473803.85830000002,300325.36229999998,525569.38390000002]
[5,"Region V - Midwest",null,"OHIO","LIMA","Elevator",95469.502399999998,152751.20619999999,133657.3034,213851.68859999999,171845.10430000001,274952.17109999998,229126.8058,366602.8947,286408.5073,458253.61839999998,324596.30820000003,519354.10080000001,362784.1091,580454.58330000006]
[5,"Region V - Midwest",null,"OHIO","LORAIN","Detached/Semi-Detached",120037.4765,210065.58379999999,155886.42850000001,272801.24969999999,186348.89929999999,326110.57380000001,222302.8107,389029.91879999998,262352.61320000002,459117.07309999998,287834.57709999999,503710.5098,311841.43680000002,545722.51439999999]
[5,"Region V - Midwest",null,"OHIO","LORAIN","Row House",100339.27129999999,175593.72469999999,133595.04370000001,233791.32639999999,164489.10509999999,287855.9339,206757.83059999999,361826.2035,249982.5631,437469.48540000001,276008.97749999998,483015.71049999999,300373.92019999999,525654.36029999994]
[5,"Region V - Midwest",null,"OHIO","LORAIN","Walkup",92396.062699999995,161693.10990000001,127573.47779999999,223253.5863,161737.62789999999,283040.84889999998,211070.43049999999,369373.25349999999,262887.63819999999,460053.36680000002,295776.66820000001,517609.16950000002,328156.8383,574274.46710000001]
[5,"Region V - Midwest",null,"OHIO","LORAIN","Elevator",103486.7697,165578.834,144881.47760000001,231810.3676,186276.18539999999,298041.90110000002,248368.24720000001,397389.20150000002,310460.30900000001,496736.50199999998,351855.01689999999,562968.03540000005,393249.72480000003,629199.56909999996]
[5,"Region V - Midwest",null,"OHIO","MANSFIELD","Detached/Semi-Detached",113843.7787,199226.6128,147885.2671,258799.2176,176821.04010000001,309436.82030000002,210987.86369999999,369228.76150000002,249035.37270000001,435811.90210000001,273239.21059999999,478168.61839999998,296056.13299999997,518098.23269999999]
[5,"Region V - Midwest",null,"OHIO","MANSFIELD","Row House",94933.444199999998,166133.52729999999,126485.5383,221349.69209999999,155835.63819999999,272712.36680000002,196064.68309999999,343113.19549999997,237160.12479999999,415030.21830000001,261886.63510000001,458301.6115,285047.3173,498832.8052]
[5,"Region V - Midwest",null,"OHIO","MANSFIELD","Walkup",87271.788100000005,152725.6293,120470.73390000001,210823.78419999999,152696.94519999999,267219.65399999998,199199.37650000001,348598.90899999999,248086.83670000001,434151.96419999999,279088.93280000001,488405.6324,309602.5233,541804.41579999996]
[5,"Region V - Midwest",null,"OHIO","MANSFIELD","Elevator",98141.924799999993,157027.08199999999,137398.69459999999,219837.9148,176655.46460000001,282648.7475,235540.6194,376864.99670000002,294425.77429999999,471081.24589999998,333682.5442,533892.07869999995,372939.31410000002,596702.91150000005]
[5,"Region V - Midwest",null,"OHIO","MARION","Detached/Semi-Detached",113843.7787,199226.6128,147885.2671,258799.2176,176821.04010000001,309436.82030000002,210987.86369999999,369228.76150000002,249035.37270000001,435811.90210000001,273239.21059999999,478168.61839999998,296056.13299999997,518098.23269999999]
[5,"Region V - Midwest",null,"OHIO","MARION","Row House",94933.444199999998,166133.52729999999,126485.5383,221349.69209999999,155835.63819999999,272712.36680000002,196064.68309999999,343113.19549999997,237160.12479999999,415030.21830000001,261886.63510000001,458301.6115,285047.3173,498832.8052]
[5,"Region V - Midwest",null,"OHIO","MARION","Walkup",87271.788100000005,152725.6293,120470.73390000001,210823.78419999999,152696.94519999999,267219.65399999998,199199.37650000001,348598.90899999999,248086.83670000001,434151.96419999999,279088.93280000001,488405.6324,309602.5233,541804.41579999996]
[5,"Region V - Midwest",null,"OHIO","MARION","Elevator",98141.924799999993,157027.08199999999,137398.69459999999,219837.9148,176655.46460000001,282648.7475,235540.6194,376864.99670000002,294425.77429999999,471081.24589999998,333682.5442,533892.07869999995,372939.31410000002,596702.91150000005]
[5,"Region V - Midwest",null,"OHIO","SPRINGFIELD","Detached/Semi-Detached",116340.5434,203595.95079999999,151124.7703,264468.348,180691.04829999999,316209.3345,215601.01490000001,377301.77600000001,254477.1274,445334.973,279208.45659999998,488614.79889999999,302521.3554,529412.37190000003]
[5,"Region V - Midwest",null,"OHIO","SPRINGFIELD","Row House",97036.247900000002,169813.4338,129279.21279999999,226238.6225,159268.44949999999,278719.7867,200366.93410000001,350642.13459999999,242354.47810000001,424120.33669999999,267619.36869999999,468333.89510000002,291283.1888,509745.58059999999]
[5,"Region V - Midwest",null,"OHIO","SPRINGFIELD","Walkup",89218.222200000004,156131.88879999999,123160.12119999999,215530.21220000001,156109.02050000001,273190.78580000001,203657.21539999999,356400.12680000003,253640.12710000001,443870.22249999997,285339.40879999998,499343.96539999999,316540.00760000001,553945.01340000005]
[5,"Region V - Midwest",null,"OHIO","SPRINGFIELD","Elevator",100294.79059999999,160471.66740000001,140412.70680000001,224660.33429999999,180530.62299999999,288849.0012,240707.49729999999,385132.00150000001,300884.37170000002,481415.00189999997,341002.288,545603.66879999998,381120.20419999998,609792.33570000005]
[5,"Region V - Midwest",null,"OHIO","TOLEDO","Detached/Semi-Detached",123879.04059999999,216788.321,160940.86240000001,281646.50910000002,192448.21650000001,336784.37880000001,229658.37779999999,401902.16110000003,271089.51240000001,474406.64679999999,297443.91440000001,520526.85029999999,322294.74339999998,564015.80090000003]
[5,"Region V - Midwest",null,"OHIO","TOLEDO","Row House",103195.8361,180592.71309999999,137534.90950000001,240686.09160000001,169495.43359999999,296617.00880000001,213336.14929999999,373338.26130000001,258100.96040000001,451676.68070000003,285027.03539999999,498797.31199999998,310253.85149999999,542944.24010000005]
[5,"Region V - Midwest",null,"OHIO","TOLEDO","Walkup",94799.332299999995,165898.83170000001,130849.0049,228985.7586,165834.74909999999,290210.81109999999,216304.2721,378532.47610000003,269382.42019999999,471419.2353,303029.28840000002,530301.25490000006,336141.85389999999,588248.24419999996]
[5,"Region V - Midwest",null,"OHIO","TOLEDO","Elevator",106790.6988,170865.1207,149506.97829999999,239211.16889999999,192223.2579,307557.21710000001,256297.67720000001,410076.28960000002,320372.09649999999,512595.36200000002,363088.37609999999,580941.41020000004,405804.6556,649287.45860000001]
[5,"Region V - Midwest",null,"OHIO","YOUNGSTOWN","Detached/Semi-Detached",120085.68799999999,210149.9541,155984.02179999999,272972.03830000001,186496.05650000001,326368.09879999998,222520.7365,389411.28899999999,262639.75349999999,459619.56849999999,288162.3186,504284.0576,312219.1814,546383.56740000006]
[5,"Region V - Midwest",null,"OHIO","YOUNGSTOWN","Row House",100190.45299999999,175333.29269999999,133469.72349999999,233572.01620000001,164417.66450000001,287730.9129,206820.30669999999,361935.5368,250146.00289999999,437755.50510000001,276218.4632,483382.31040000002,300636.98969999998,526114.73199999996]
[5,"Region V - Midwest",null,"OHIO","YOUNGSTOWN","Walkup",92137.873600000006,161241.2789,127194.20299999999,222589.8553,161227.1347,282147.48580000002,210343.97560000001,368101.95730000001,261970.0655,458447.61469999998,294715.12599999999,515751.4705,326946.23790000001,572155.91639999999]
[5,"Region V - Midwest",null,"OHIO","YOUNGSTOWN","Elevator",103524.0874,165638.5423,144933.72229999999,231893.95920000001,186343.3573,298149.3762,248457.80970000001,397532.50150000001,310572.2622,496915.62689999997,351981.8971,563171.04379999998,393391.53210000001,629426.46070000005]
[5,"Region V - Midwest",null,"WISCONSIN","BELOIT","Detached/Semi-Detached",125127.4209,218972.98670000001,162560.61139999999,284481.0699,194383.21739999999,340170.63050000003,231964.94949999999,405938.6618,273810.38540000003,479168.17440000002,300428.53249999997,525749.93189999997,325527.3492,569672.86109999998]
[5,"Region V - Midwest",null,"WISCONSIN","BELOIT","Row House",104247.2366,182432.66399999999,138931.74479999999,243130.55350000001,171211.83679999999,299620.7145,215487.2715,377102.72519999999,260698.1329,456221.73269999999,287893.39750000002,503813.44579999999,313371.78220000002,548400.61899999995]
[5,"Region V - Midwest",null,"WISCONSIN","BELOIT","Walkup",95772.548299999995,167601.9595,132193.69709999999,231338.97,167540.78510000001,293196.3738,218533.18919999999,382433.08110000001,272159.0626,476278.35950000002,306154.52340000001,535770.41599999997,339610.59269999998,594318.53709999996]
[5,"Region V - Midwest",null,"WISCONSIN","BELOIT","Elevator",107867.13009999999,172587.41080000001,151013.98209999999,241622.375,194160.83420000001,310657.33929999999,258881.1122,414209.7856,323601.39020000002,517762.23210000002,366748.24229999998,586797.19629999995,409895.0943,655832.16059999994]
[5,"Region V - Midwest",null,"WISCONSIN","EAU CLAIRE","Detached/Semi-Detached",125631.08590000001,219854.40040000001,163126.5068,285471.38679999998,194982.83040000001,341219.95309999998,232573.42720000001,407003.4976,274452.97840000002,480292.71230000001,301101.49540000001,526927.61699999997,326199.29920000001,570848.77359999996]
[5,"Region V - Midwest",null,"WISCONSIN","EAU CLAIRE","Row House",105144.9863,184003.726,139943.4675,244901.0681,172248.6452,301435.12910000002,216406.64850000001,378711.6348,261588.1268,457779.2219,288802.87229999999,505405.02649999998,314273.08240000001,549977.89419999998]
[5,"Region V - Midwest",null,"WISCONSIN","EAU CLAIRE","Walkup",96904.632700000002,169583.1073,133814.23550000001,234174.91209999999,169670.04259999999,296922.57459999999,221463.79399999999,387561.63959999999,275841.32659999997,482722.32150000002,310371.00900000002,543149.26569999999,344371.47700000001,602650.08479999995]
[5,"Region V - Midwest",null,"WISCONSIN","EAU CLAIRE","Elevator",108312.0546,173299.2899,151636.8763,242619.00580000001,194961.69820000001,311938.72169999999,259948.93090000001,415918.29560000001,324936.16360000003,519897.86940000003,368260.9853,589217.58530000004,411585.80719999998,658537.30130000005]
[5,"Region V - Midwest",null,"WISCONSIN","GREEN BAY","Detached/Semi-Detached",131031.8458,229305.73009999999,169976.20670000001,297458.36170000001,203028.1274,355299.223,241972.33420000001,423451.58480000001,285404.77549999999,499458.35710000002,313057.43949999998,547850.51910000003,339046.17499999999,593330.80610000005]
[5,"Region V - Midwest",null,"WISCONSIN","GREEN BAY","Row House",110545.9711,193455.44949999999,146793.16750000001,256888.04300000001,180293.94219999999,315514.39899999998,225805.55549999999,395159.72200000001,272539.92379999999,476944.86670000001,300758.81630000001,526327.92859999998,327119.95809999999,572459.92669999995]
[5,"Region V - Midwest",null,"WISCONSIN","GREEN BAY","Walkup",102445.95540000001,179280.42199999999,141572.08730000001,247751.15280000001,179644.42360000001,314377.74119999999,234762.96859999999,410835.19500000001,292465.29479999997,511814.2659,329211.50630000001,576120.13600000006,365428.50339999999,639499.88100000005]
[5,"Region V - Midwest",null,"WISCONSIN","GREEN BAY","Elevator",112988.06540000001,180780.9074,158183.2916,253093.27040000001,203378.5178,325405.63329999999,271171.35700000002,433874.1777,338964.19630000001,542342.72219999996,384159.42249999999,614655.08519999997,429354.64860000001,686967.44810000004]
[5,"Region V - Midwest",null,"WISCONSIN","KENOSHA","Detached/Semi-Detached",133073.16440000001,232878.03769999999,172747.41759999999,302307.98070000001,206445.69140000001,361279.95970000001,246194.9473,430841.15779999999,290491.09360000002,508359.41389999999,318681.48190000001,557692.59329999995,345217.21110000001,604130.11950000003]
[5,"Region V - Midwest",null,"WISCONSIN","KENOSHA","Row House",111602.21309999999,195303.87289999999,148449.8075,259787.16310000001,182618.51490000001,319582.40100000001,229250.9184,401189.10720000003,277007.73859999998,484763.54249999998,305791.57799999998,535135.26139999996,332717.6176,582255.83089999994]
[5,"Region V - Midwest",null,"WISCONSIN","KENOSHA","Walkup",103002.1217,180253.71299999999,142261.66940000001,248957.9215,180416.75829999999,315729.32699999999,235563.76089999999,412236.58159999998,293418.76510000002,513482.83889999997,330183.973,577821.95279999997,366394.52360000001,641190.41630000004]
[5,"Region V - Midwest",null,"WISCONSIN","KENOSHA","Elevator",114733.3309,183573.3322,160626.66329999999,257002.66510000001,206519.99559999999,330431.99790000002,275359.99420000002,440575.99729999999,344199.9927,550719.99659999995,390093.32510000002,624149.32940000005,435986.65749999997,697578.66229999997]
[5,"Region V - Midwest",null,"WISCONSIN","LA CROSSE","Detached/Semi-Detached",125823.93610000001,220191.88819999999,163516.88630000001,286154.55099999998,195571.46599999999,342250.06559999997,233445.13930000001,408528.99369999999,275601.55009999999,482302.71269999997,302412.47360000003,529221.82889999996,327710.2904,573493.00829999999]
[5,"Region V - Midwest",null,"WISCONSIN","LA CROSSE","Row House",104549.7147,182962.0007,139442.18979999999,244023.83230000001,171962.88740000001,300935.05290000001,216656.56,379148.98009999999,262241.89549999998,458923.31709999999,289640.82559999998,506871.4448,315325.37199999997,551819.40099999995]
[5,"Region V - Midwest",null,"WISCONSIN","LA CROSSE","Walkup",95871.876900000003,167775.78460000001,132297.1367,231519.98929999999,167628.07029999999,293349.12300000002,218557.9743,382476.45500000002,272171.03580000001,476299.31270000001,306124.83970000001,535718.46959999995,339529.0748,594175.88100000005]
[5,"Region V - Midwest",null,"WISCONSIN","LA CROSSE","Elevator",108461.32889999999,173538.12890000001,151845.86050000001,242953.38029999999,195230.39199999999,312368.63179999997,260307.1894,416491.50910000002,325383.9866,520614.38640000002,368768.5183,590029.63789999997,412153.04979999998,659444.88950000005]
[5,"Region V - Midwest",null,"WISCONSIN","MADISON","Detached/Semi-Detached",128727.9311,225273.87950000001,167127.08249999999,292472.39449999999,199746.75409999999,349556.8198,238230.89379999999,416904.06410000002,281111.5907,491945.28360000002,308399.16979999997,539698.54709999997,334091.94150000002,584660.89769999997]
[5,"Region V - Midwest",null,"WISCONSIN","MADISON","Row House",107847.8967,188733.8193,143498.21599999999,251121.878,176575.37349999999,309006.90370000002,221753.21580000001,388068.1275,267999.3382,468998.8419,295864.03480000002,517762.06099999999,321936.37459999998,563388.65549999999]
[5,"Region V - Midwest",null,"WISCONSIN","MADISON","Walkup",99466.767099999997,174066.8425,137365.6035,240389.80609999999,174190.37899999999,304833.16310000001,227399.3144,397948.8002,283241.71909999999,495673.00839999999,318714.86739999999,557751.01800000004,353648.62420000002,618885.09239999996]
[5,"Region V - Midwest",null,"WISCONSIN","MADISON","Elevator",110984.47380000001,177575.16080000001,155378.26329999999,248605.22500000001,199772.0528,319635.2892,266362.73700000002,426180.38569999998,332953.42139999999,532725.48210000002,377347.2108,603755.54630000005,421741.00030000001,674785.61069999996]
[5,"Region V - Midwest",null,"WISCONSIN","MILWAUKEE","Detached/Semi-Detached",131128.26879999999,229474.47039999999,170171.39369999999,297799.9388,203322.4417,355814.27299999999,242408.18580000001,424214.32510000002,285979.05599999998,500463.348,313712.9227,548997.61470000003,339801.66409999999,594652.91209999996]
[5,"Region V - Midwest",null,"WISCONSIN","MILWAUKEE","Row House",110248.33440000001,192934.58530000001,146542.52710000001,256449.42240000001,180151.06109999999,315264.35690000001,225930.50769999999,395378.3885,272866.80359999998,477516.90620000003,301177.78779999999,527061.12860000005,327646.09710000001,573380.67000000004]
[5,"Region V - Midwest",null,"WISCONSIN","MILWAUKEE","Walkup",101929.5772,178376.76019999999,140813.53769999999,246423.69089999999,178623.43719999999,312591.01500000001,233310.05859999999,408292.60269999999,290630.14939999999,508602.76140000002,327088.42170000001,572404.73809999996,363007.3026,635262.77949999995]
[5,"Region V - Midwest",null,"WISCONSIN","MILWAUKEE","Elevator",113062.70080000001,180900.3241,158287.7812,253260.45370000001,203512.8616,325620.5833,271350.48200000002,434160.77779999998,339188.10259999998,542700.97219999996,384413.18290000001,615061.10179999995,429638.26329999999,687421.23140000005]
[5,"Region V - Midwest",null,"WISCONSIN","OSHKOSH","Detached/Semi-Detached",122582.44869999999,214519.28520000001,159223.51990000001,278641.15980000002,190366.05840000001,333140.60210000002,227133.88020000001,397484.29029999999,268081.49930000002,469142.6238,294131.55479999998,514730.22080000001,318684.39299999998,557697.68779999996]
[5,"Region V - Midwest",null,"WISCONSIN","OSHKOSH","Row House",102293.2539,179013.19440000001,136263.39430000001,238460.9399,167850.47089999999,293738.32419999997,211122.55110000001,369464.4644,255340.348,446845.609,281951.1875,493414.57809999998,306872.85119999998,537027.48970000003]
[5,"Region V - Midwest",null,"WISCONSIN","OSHKOSH","Walkup",94084.305600000007,164647.53469999999,129883.58749999999,227296.2781,164639.2065,288118.61139999999,214801.80989999999,375903.16729999997,267523.3504,468165.86320000002,300965.59580000001,526689.79269999999,333883.71549999999,584296.50210000004]
[5,"Region V - Midwest",null,"WISCONSIN","OSHKOSH","Elevator",105676.94990000001,169083.12229999999,147947.72990000001,236716.37119999999,190218.5098,304349.6201,253624.67970000001,405799.49359999999,317030.84960000002,507249.36700000003,359301.62959999999,574882.61589999998,401572.40950000001,642515.86490000004]
[5,"Region V - Midwest",null,"WISCONSIN","RACINE","Detached/Semi-Detached",128727.9311,225273.87950000001,167127.08249999999,292472.39449999999,199746.75409999999,349556.8198,238230.89379999999,416904.06410000002,281111.5907,491945.28360000002,308399.16979999997,539698.54709999997,334091.94150000002,584660.89769999997]
[5,"Region V - Midwest",null,"WISCONSIN","RACINE","Row House",107847.8967,188733.8193,143498.21599999999,251121.878,176575.37349999999,309006.90370000002,221753.21580000001,388068.1275,267999.3382,468998.8419,295864.03480000002,517762.06099999999,321936.37459999998,563388.65549999999]
[5,"Region V - Midwest",null,"WISCONSIN","RACINE","Walkup",99466.767099999997,174066.8425,137365.6035,240389.80609999999,174190.37899999999,304833.16310000001,227399.3144,397948.8002,283241.71909999999,495673.00839999999,318714.86739999999,557751.01800000004,353648.62420000002,618885.09239999996]
[5,"Region V - Midwest",null,"WISCONSIN","RACINE","Elevator",110984.47380000001,177575.16080000001,155378.26329999999,248605.22500000001,199772.0528,319635.2892,266362.73700000002,426180.38569999998,332953.42139999999,532725.48210000002,377347.2108,603755.54630000005,421741.00030000001,674785.61069999996]
[5,"Region V - Midwest",null,"WISCONSIN","SUPERIOR","Detached/Semi-Detached",124623.76730000001,218091.59280000001,161994.73069999999,283490.77879999997,193783.62220000001,339121.33899999998,231356.4932,404873.86320000002,273167.8174,478043.68050000002,299755.59720000002,524572.29500000004,324855.42920000001,568497.00100000005]
[5,"Region V - Midwest",null,"WISCONSIN","SUPERIOR","Row House",103349.49589999999,180861.61780000001,137920.0343,241360.0601,170175.0436,297806.32620000001,214567.91399999999,375493.84950000001,259808.16269999999,454664.28480000002,286983.94910000003,502221.91090000002,312470.51079999999,546823.39379999996]
[5,"Region V - Midwest",null,"WISCONSIN","SUPERIOR","Walkup",94640.471799999999,165620.82569999999,130573.16959999999,228503.04689999999,165411.54130000001,289470.1972,215602.60219999999,377304.55379999999,268476.82069999998,469834.4362,301938.0626,528391.60959999997,334849.73560000001,585987.03740000003]
[5,"Region V - Midwest",null,"WISCONSIN","SUPERIOR","Elevator",107422.2153,171875.5471,150391.10149999999,240625.766,193359.98759999999,309375.98479999998,257813.31690000001,412501.31300000002,322266.64600000001,515626.64140000002,365235.53220000002,584376.8602,408204.41830000002,653127.07909999997]
[5,"Region V - Midwest",null,"WISCONSIN","WAUSAU","Detached/Semi-Detached",121934.1528,213384.76740000001,158364.8486,277138.4852,189324.97930000001,331318.71380000003,225871.63140000001,395275.35489999998,266577.4927,466510.61219999997,292475.3749,511831.90610000002,316879.21779999998,554538.63119999995]
[5,"Region V - Midwest",null,"WISCONSIN","WAUSAU","Row House",101841.9629,178223.435,135627.6367,237348.36420000001,167027.98970000001,292298.98180000001,210015.7519,367527.56579999998,253960.04180000001,444430.07319999998,280413.2635,490723.21120000002,305182.35110000003,534069.11439999996]
[5,"Region V - Midwest",null,"WISCONSIN","WAUSAU","Walkup",93726.792100000006,164021.88630000001,129400.87880000001,226451.5379,164041.43520000001,287072.51150000002,214050.57879999999,374588.51289999997,266593.81550000003,466539.17719999998,299933.74949999998,524884.06169999996,332754.64630000002,582320.63100000005]
[5,"Region V - Midwest",null,"WISCONSIN","WAUSAU","Elevator",105120.0754,168192.1232,147168.10560000001,235468.9724,189216.13570000001,302745.82160000002,252288.18100000001,403661.0956,315360.22619999998,504576.36940000003,357408.25640000001,571853.21869999997,399456.28659999999,639130.06799999997]
[6,"Region VI - Midsouth",null,"ARKANSAS","FAYETTEVILLE","Detached/Semi-Detached",105946.25109999999,185405.9393,137796.06020000001,241143.10519999999,164905.73060000001,288585.02850000001,196975.80059999999,344707.65110000002,232641.81529999999,407123.17670000001,255314.01449999999,446799.52539999998,276744.02860000002,484302.05009999999]
[6,"Region VI - Midsouth",null,"ARKANSAS","FAYETTEVILLE","Row House",87429.651199999993,153001.88959999999,116842.15850000001,204473.7775,144357.52410000001,252625.66709999999,182363.51930000001,319136.15889999998,221013.9682,386774.44429999997,244197.9509,427346.41409999999,265964.56300000002,465437.9853]
[6,"Region VI - Midsouth",null,"ARKANSAS","FAYETTEVILLE","Walkup",79784.026199999993,139622.0459,110023.48729999999,192541.10279999999,139310.47930000001,243793.33869999999,181442.35010000001,317524.11259999999,225909.56159999999,395341.7328,253997.94080000001,444496.39620000002,281607.9915,492813.9852]
[6,"Region VI - Midsouth",null,"ARKANSAS","FAYETTEVILLE","Elevator",91313.045199999993,146100.87450000001,127838.2632,204541.2242,164363.48130000001,262981.57400000002,219151.30840000001,350642.09860000003,273939.13549999997,438302.62339999998,310464.35350000003,496742.9731,346989.57160000002,555183.32290000003]
[6,"Region VI - Midsouth",null,"ARKANSAS","FORT SMITH","Detached/Semi-Detached",104912.26270000001,183596.45980000001,136156.64060000001,238274.12109999999,162687.3933,284702.93839999998,193970.1441,339447.75219999999,228840.685,400471.19880000001,251035.89989999999,439312.8248,271916.89480000001,475854.56589999999]
[6,"Region VI - Midsouth",null,"ARKANSAS","FORT SMITH","Row House",88168.907800000001,154295.58869999999,117208.96309999999,205115.68539999999,144106.56770000001,252186.49359999999,180756.9106,316324.59350000002,218326.1421,382070.7487,240984.14,421722.24489999999,262169.50540000002,458796.63439999998]
[6,"Region VI - Midsouth",null,"ARKANSAS","FORT SMITH","Walkup",81492.027199999997,142611.0477,112574.97960000001,197006.21429999999,142796.65659999999,249894.14920000001,186502.76310000001,326379.83539999998,232320.61379999999,406561.07419999997,261458.4388,457552.26799999998,290163.7328,507786.53240000003]
[6,"Region VI - Midsouth",null,"ARKANSAS","FORT SMITH","Elevator",90457.628800000006,144732.2083,126640.68030000001,202625.09160000001,162823.73190000001,260517.9749,217098.30919999999,347357.29989999998,271372.88650000002,434196.6249,307555.93800000002,492089.50819999998,343738.98950000003,549982.39139999996]
[6,"Region VI - Midsouth",null,"ARKANSAS","HOT SPRINGS","Detached/Semi-Detached",102704.7675,179733.34299999999,133502.69880000001,233629.723,159700.3291,279475.5759,190664.5491,333662.96090000001,225121.77350000001,393963.10340000002,247033.10550000001,432307.93459999998,267718.14199999999,468506.74839999998]
[6,"Region VI - Midsouth",null,"ARKANSAS","HOT SPRINGS","Row House",85173.193199999994,149053.08790000001,113663.3668,198910.89189999999,140245.11249999999,245428.94699999999,176829.51689999999,309451.65470000001,214112.429,374696.75069999998,236508.32199999999,413889.56349999999,257512.05230000001,450646.09149999998]
[6,"Region VI - Midsouth",null,"ARKANSAS","HOT SPRINGS","Walkup",77996.456999999995,136493.79980000001,107609.94100000001,188317.39670000001,136321.61900000001,238562.8333,177686.19010000001,310950.83270000003,221261.88159999999,387208.2929,248838.70300000001,435467.73019999999,275962.63880000002,482934.61800000002]
[6,"Region VI - Midsouth",null,"ARKANSAS","HOT SPRINGS","Elevator",88528.669500000004,141645.87330000001,123940.1372,198304.22260000001,159351.60509999999,254962.57190000001,212468.80669999999,339950.09580000001,265586.0085,424937.61989999999,300997.47619999998,481595.96909999999,336408.94400000002,538254.31850000005]
[6,"Region VI - Midsouth",null,"ARKANSAS","JONESBORO","Detached/Semi-Detached",100567.0333,175992.3083,130536.31080000001,228438.54380000001,155988.46230000001,272979.80910000001,186006.09820000001,325510.67170000001,219461.19089999999,384057.08419999998,240753.59760000001,421318.79580000002,260791.63589999999,456385.3628]
[6,"Region VI - Midsouth",null,"ARKANSAS","JONESBORO","Row House",84414.594200000007,147725.5399,112257.37549999999,196450.40700000001,138063.43119999999,241611.00469999999,173259.21460000001,303203.62540000002,209317.7499,366306.0625,231056.606,404349.06050000002,251388.27239999999,439929.4767]
[6,"Region VI - Midsouth",null,"ARKANSAS","JONESBORO","Walkup",77956.674799999993,136424.18090000001,107678.91650000001,188438.10389999999,136570.28090000001,238997.99160000001,178338.321,312092.06180000002,222143.57329999999,388751.25339999999,249989.33929999999,437481.34389999998,277417.84019999998,485481.22029999999]
[6,"Region VI - Midsouth",null,"ARKANSAS","JONESBORO","Elevator",86708.774999999994,138734.04209999999,121392.285,194227.65900000001,156075.79500000001,249721.2757,208101.06,332961.701,260126.32500000001,416202.1262,294809.83500000002,471695.74300000002,329493.34499999997,527189.35990000004]
[6,"Region VI - Midsouth",null,"ARKANSAS","LITTLE ROCK","Detached/Semi-Detached",110098.63400000001,192672.6096,143026.01560000001,250295.52729999999,171016.03200000001,299278.05599999998,204068.1421,357119.2487,240872.74660000001,421527.30660000001,264285.34840000002,462499.35979999998,286358.30709999998,501127.03730000003]
[6,"Region VI - Midsouth",null,"ARKANSAS","LITTLE ROCK","Row House",91779.239100000006,160613.6684,122295.02770000001,214016.2985,150686.42319999999,263701.24060000002,189611.31039999999,331819.79320000001,229368.5999,401395.04989999998,253287.54070000001,443253.19620000001,275693.51650000003,482463.65389999998]
[6,"Region VI - Midsouth",null,"ARKANSAS","LITTLE ROCK","Walkup",84352.136700000003,147616.23920000001,116436.65210000001,203764.14110000001,147578.8309,258262.9541,192512.61619999999,336897.0784,239756.89840000001,419574.57209999999,269713.2156,471998.12729999999,299196.29300000001,523593.51280000003]
[6,"Region VI - Midsouth",null,"ARKANSAS","LITTLE ROCK","Elevator",94912.627900000007,151860.20699999999,132877.67910000001,212604.28969999999,170842.73019999999,273348.3725,227790.30710000001,364464.49670000002,284737.88380000001,455580.62089999998,322702.935,516324.70360000001,360667.98619999998,577068.78650000005]
[6,"Region VI - Midsouth",null,"ARKANSAS","TEXARKANA","Detached/Semi-Detached",101863.62519999999,178261.34409999999,132253.6532,231443.89309999999,158070.62040000001,276623.5858,188530.59580000001,329928.54259999999,222469.2041,389321.10729999997,244065.95730000001,427115.4252,264401.98629999999,462703.47600000002]
[6,"Region VI - Midsouth",null,"ARKANSAS","TEXARKANA","Row House",85317.176300000006,149305.05859999999,113528.8907,198675.55859999999,139708.3939,244489.6894,175472.81280000001,307077.42249999999,212078.36240000001,371137.13410000002,234132.45389999999,409731.79430000001,254769.2726,445846.22710000002]
[6,"Region VI - Midsouth",null,"ARKANSAS","TEXARKANA","Walkup",78671.7016,137675.47779999999,108644.33379999999,190127.58429999999,137765.8236,241090.19130000001,179840.78330000001,314721.37060000002,224002.64309999999,392004.62540000002,252053.03200000001,441092.80609999999,279675.97850000003,489432.96240000002]
[6,"Region VI - Midsouth",null,"ARKANSAS","TEXARKANA","Elevator",87822.524000000005,140516.0405,122951.53350000001,196722.4566,158080.54319999999,252928.87280000001,210774.0575,337238.49709999998,263467.57189999998,421548.1213,298596.58140000002,477754.53749999998,333725.59100000001,533960.95369999995]
[6,"Region VI - Midsouth",null,"ARKANSAS","WEST MEMPHIS","Detached/Semi-Detached",108898.46520000001,190572.31409999999,141503.85999999999,247631.75520000001,169228.1882,296149.32939999999,201979.49609999999,353464.11810000002,238439.01389999999,417268.2745,261628.47200000001,457849.826,283503.44579999999,496131.03009999997]
[6,"Region VI - Midsouth",null,"ARKANSAS","WEST MEMPHIS","Row House",90579.020300000004,158513.28539999999,120772.87209999999,211352.52619999999,148898.57939999999,260572.514,187522.66450000001,328164.66269999999,226934.86730000001,397136.01770000003,250630.6643,438603.66249999998,272838.65519999998,477467.64659999998]
[6,"Region VI - Midsouth",null,"ARKANSAS","WEST MEMPHIS","Walkup",83120.731700000004,145461.28030000001,114712.685,200747.19870000001,145362.30179999999,254384.0281,189557.24419999999,331725.17729999998,236062.6832,413109.69559999998,265526.43839999998,464671.2672,294516.95380000002,515404.6692]
[6,"Region VI - Midsouth",null,"ARKANSAS","WEST MEMPHIS","Elevator",93873.5144,150197.62530000001,131422.92009999999,210276.67540000001,168972.3259,270355.7255,225296.43460000001,360474.30070000002,281620.54320000001,450592.87589999998,319169.94890000002,510671.92589999997,356719.35470000003,570750.97609999997]
[6,"Region VI - Midsouth",null,"LOUISIANA","ALEXANDRIA","Detached/Semi-Detached",105753.40459999999,185068.45819999999,137405.68580000001,240459.95,164317.101,287554.92680000002,196104.0961,343182.16820000001,231493.25260000001,405113.19199999998,254003.04620000001,444505.3308,275233.04810000001,481657.83429999999]
[6,"Region VI - Midsouth",null,"LOUISIANA","ALEXANDRIA","Row House",88024.925399999993,154043.61960000001,117343.44010000001,205351.02,144643.2867,253125.7518,182113.61429999999,318698.82510000002,220360.2078,385630.36359999998,243360.0068,425880.01189999998,264912.28350000002,463596.49609999999]
[6,"Region VI - Midsouth",null,"LOUISIANA","ALEXANDRIA","Walkup",80816.784199999995,141429.37239999999,111540.5889,195196.0307,141352.45509999999,247366.7965,184348.17430000001,322609.30499999999,229579.8579,401764.7512,258244.11610000001,451927.20319999999,286450.40039999998,501288.20069999999]
[6,"Region VI - Midsouth",null,"LOUISIANA","ALEXANDRIA","Elevator",91163.774099999995,145862.04079999999,127629.2838,204206.85709999999,164094.7934,262551.67330000002,218793.05790000001,350068.89789999998,273491.3223,437586.12229999999,309956.8321,495930.93859999999,346422.34169999999,554275.75490000006]
[6,"Region VI - Midsouth",null,"LOUISIANA","BATON ROUGE","Detached/Semi-Detached",108753.8268,190319.19699999999,141211.07459999999,247119.3805,168786.71049999999,295376.74339999998,201325.71109999999,352319.99449999997,237577.58429999999,415760.77240000002,260645.23730000001,456129.16529999999,282370.20130000002,494147.85239999997]
[6,"Region VI - Midsouth",null,"LOUISIANA","BATON ROUGE","Row House",91025.472599999994,159294.57709999999,121148.82889999999,212010.45050000001,149112.89619999999,260947.56839999999,187335.22940000001,327836.65139999997,226444.53950000001,396277.94400000002,250002.1979,437503.84639999998,272049.43660000002,476086.51419999998]
[6,"Region VI - Midsouth",null,"LOUISIANA","BATON ROUGE","Walkup",83895.296799999996,146816.76949999999,115850.50659999999,202738.3866,146893.77789999999,257064.11120000001,191736.60459999999,335539.05800000002,238815.39569999999,417926.9425,268711.05900000001,470244.35330000002,298148.74839999998,521760.30969999998]
[6,"Region VI - Midsouth",null,"LOUISIANA","BATON ROUGE","Elevator",93761.558000000005,150018.495,131266.18109999999,210025.89300000001,168770.80429999999,270033.29090000002,225027.73910000001,360044.38799999998,281284.67389999999,450055.48499999999,318789.29710000003,510062.88290000003,356293.9203,570070.28090000001]
[6,"Region VI - Midsouth",null,"LOUISIANA","LAFAYETTE","Detached/Semi-Detached",109402.1266,191453.72159999999,142069.75090000001,248622.06409999999,169827.79579999999,297198.64260000002,202587.96739999999,354528.94309999997,239081.5998,418392.79969999997,262301.42700000003,459027.49729999999,284175.3873,497306.9277]
[6,"Region VI - Midsouth",null,"LOUISIANA","LAFAYETTE","Row House",91476.766399999993,160084.3412,121784.59020000001,213123.03289999999,149935.38250000001,262386.91930000001,188442.03510000001,329773.56150000001,227824.85389999999,398693.49430000002,251540.13099999999,440195.22930000001,273739.94689999998,479044.90700000001]
[6,"Region VI - Midsouth",null,"LOUISIANA","LAFAYETTE","Walkup",84252.812399999995,147442.42170000001,116333.2182,203583.13190000001,147491.5528,258110.21729999999,192487.84020000001,336853.72029999999,239744.93609999999,419553.63829999999,269742.91149999999,472050.09519999998,299277.82429999998,523736.1925]
[6,"Region VI - Midsouth",null,"LOUISIANA","LAFAYETTE","Elevator",94318.435800000007,150909.49950000001,132045.8101,211273.29930000001,169773.18429999999,271637.09899999999,226364.24590000001,362182.79869999998,282955.30729999999,452728.49839999998,320682.68160000001,513092.29810000001,358410.05589999998,573456.09790000005]
[6,"Region VI - Midsouth",null,"LOUISIANA","LAKE CHARLES","Detached/Semi-Detached",107409.027,187965.79730000001,139396.14319999999,243943.2506,166557.40049999999,291475.451,198583.29389999999,347520.76439999999,234282.4382,409994.26669999998,257005.1439,449759.00189999997,278382.11489999999,487168.70110000001]
[6,"Region VI - Midsouth",null,"LOUISIANA","LAKE CHARLES","Row House",90271.712400000004,157975.49669999999,120002.6384,210004.61720000001,147539.37950000001,258193.91409999999,185059.1611,323853.5319,223520.4944,391160.8653,246716.87220000001,431754.52639999997,268405.37540000002,469709.4069]
[6,"Region VI - Midsouth",null,"LOUISIANA","LAKE CHARLES","Walkup",83438.462799999994,146017.30989999999,115264.36930000001,201712.64610000001,146208.73499999999,255865.28630000001,190960.60620000001,334181.06089999998,237873.90969999999,416279.342,267708.92109999998,468490.61200000002,297101.22440000001,519927.14260000002]
[6,"Region VI - Midsouth",null,"LOUISIANA","LAKE CHARLES","Elevator",92610.494399999996,148176.79329999999,129654.6922,207447.51060000001,166698.88990000001,266718.2279,222265.18659999999,355624.30379999999,277831.48320000002,444530.3798,314875.68099999998,503801.09700000001,351919.8787,563071.81440000003]
[6,"Region VI - Midsouth",null,"LOUISIANA","MONROE","Detached/Semi-Detached",105801.6165,185152.82879999999,137503.27970000001,240630.7395,164464.2591,287812.4534,196322.0232,343563.54060000001,231780.39449999999,405615.69040000002,254330.78969999999,445078.88199999998,275610.79499999998,482318.89120000001]
[6,"Region VI - Midsouth",null,"LOUISIANA","MONROE","Row House",87876.106199999995,153783.18599999999,117218.11900000001,205131.7084,144571.84580000001,253000.73009999999,182176.09090000001,318808.15909999999,220523.64859999999,385916.38510000001,243569.49369999999,426246.614,265175.35450000002,464056.87040000001]
[6,"Region VI - Midsouth",null,"LOUISIANA","MONROE","Walkup",80558.593599999993,140977.53880000001,111161.3118,194532.29569999999,140841.9589,246473.42800000001,183621.715,321338.0012,228662.27970000001,400158.98950000003,257182.5675,450069.49310000002,285239.7928,499169.6373]
[6,"Region VI - Midsouth",null,"LOUISIANA","MONROE","Elevator",91201.092099999994,145921.74950000001,127681.5289,204290.44930000001,164161.9656,262659.14899999998,218882.62100000001,350212.1986,273603.27610000002,437765.24839999998,310083.71299999999,496133.94819999998,346564.14980000001,554502.64800000004]
[6,"Region VI - Midsouth",null,"LOUISIANA","NEW ORLEANS","Detached/Semi-Detached",110602.2991,193554.02340000001,143591.91099999999,251285.84419999999,171615.64490000001,300327.3786,204676.61970000001,358184.0845,241515.33979999999,422651.84450000001,264958.31140000001,463677.04489999998,287030.25709999999,502302.9498]
[6,"Region VI - Midsouth",null,"LOUISIANA","NEW ORLEANS","Row House",92676.988800000006,162184.73050000001,123306.7503,215786.8131,151723.2316,265515.65529999998,190530.68729999999,333428.70289999997,230258.59390000001,402952.5392,254197.01550000001,444844.777,276594.81660000002,484040.92910000001]
[6,"Region VI - Midsouth",null,"LOUISIANA","NEW ORLEANS","Walkup",85484.221099999995,149597.38690000001,118057.19040000001,206600.08319999999,149708.08850000001,261989.15479999999,195443.2211,342025.63689999998,243439.1623,426018.53409999999,273929.70110000001,479376.97700000001,303957.17749999999,531925.06050000002]
[6,"Region VI - Midsouth",null,"LOUISIANA","NEW ORLEANS","Elevator",95357.5524,152572.08609999999,133500.57329999999,213600.92060000001,171643.5943,274629.7549,228858.12580000001,366173.00660000002,286072.65720000002,457716.25829999999,324215.67810000002,518745.09279999998,362358.69910000003,579773.92720000003]
[6,"Region VI - Midsouth",null,"LOUISIANA","SHREVEPORT","Detached/Semi-Detached",110050.42260000001,192588.2395,142928.4222,250124.73879999999,170868.87479999999,299020.53090000001,203850.2163,356737.87849999999,240585.60639999999,421024.8112,263957.60680000001,461925.81199999998,285980.5625,500465.98430000001]
[6,"Region VI - Midsouth",null,"LOUISIANA","SHREVEPORT","Row House",91928.057400000005,160874.10060000001,122420.34789999999,214235.60879999999,150757.86379999999,263826.26169999997,189548.83429999999,331710.46000000002,229205.16010000001,401109.03009999997,253078.05499999999,442886.59629999998,275430.44699999999,482003.28220000002]
[6,"Region VI - Midsouth",null,"LOUISIANA","SHREVEPORT","Walkup",84610.325800000006,148068.07019999999,116815.92690000001,204427.87210000001,148089.3242,259156.31709999999,193239.07130000001,338168.37469999999,240674.47099999999,421180.32429999998,270774.75780000002,473855.82620000001,300406.89350000001,525712.06350000005]
[6,"Region VI - Midsouth",null,"LOUISIANA","SHREVEPORT","Elevator",94875.310200000007,151800.49859999999,132825.43429999999,212520.69810000001,170775.55840000001,273240.89750000002,227700.74460000001,364321.19679999998,284625.93070000003,455401.49589999998,322576.05479999998,516121.69530000002,360526.1789,576841.89480000001]
[6,"Region VI - Midsouth",null,"NEW MEXICO","ALBUQUERQUE","Detached/Semi-Detached",111850.67939999999,195738.68900000001,145211.66010000001,254120.4051,173550.6459,303713.63020000001,206983.19149999999,362220.58510000003,244236.2127,427413.37219999998,267942.92940000002,468900.12650000001,290262.86290000001,507960.01]
[6,"Region VI - Midsouth",null,"NEW MEXICO","ALBUQUERQUE","Row House",93728.389299999995,164024.6813,124703.5857,218231.27499999999,153439.6348,268519.36099999998,192681.80960000001,337193.1667,232855.76629999999,407497.59100000001,257063.37760000001,449860.91080000001,279712.74739999999,489497.30790000001]
[6,"Region VI - Midsouth",null,"NEW MEXICO","ALBUQUERQUE","Walkup",86457.437000000005,151300.51490000001,119401.8826,208953.29459999999,151414.1244,264974.71759999997,197672.13819999999,345926.24190000002,246215.80480000001,430877.65830000001,277054.93609999999,484846.13819999999,307425.91629999998,537995.35329999996]
[6,"Region VI - Midsouth",null,"NEW MEXICO","ALBUQUERQUE","Elevator",96433.983600000007,154294.37609999999,135007.57709999999,216012.12650000001,173581.17050000001,277729.87699999998,231441.5607,370306.50270000001,289301.9509,462883.12839999999,327875.54430000001,524600.87879999995,366449.13780000003,586318.62919999997]
[6,"Region VI - Midsouth",null,"NEW MEXICO","CLOVIS","Detached/Semi-Detached",112547.1869,196957.57699999999,146167.9247,255793.8682,174738.88200000001,305793.04359999998,208463.36610000001,364810.89069999999,246027.35949999999,430547.87900000002,269926.85090000002,472371.989,292445.78259999998,511780.11959999998]
[6,"Region VI - Midsouth",null,"NEW MEXICO","CLOVIS","Row House",94030.861999999994,164554.0086,125214.02310000001,219124.5405,154190.67559999999,269833.68219999998,193851.08489999999,339239.39840000001,234399.51240000001,410199.14669999998,258810.7873,452918.87770000001,281666.31709999999,492916.05479999998]
[6,"Region VI - Midsouth",null,"NEW MEXICO","CLOVIS","Walkup",86556.761400000003,151474.33240000001,119505.3164,209134.30379999999,151501.4025,265127.45439999999,197696.91440000001,345969.60019999999,246227.76689999999,430898.59210000001,277025.2402,484794.1703,307344.38500000001,537852.67370000004]
[6,"Region VI - Midsouth",null,"NEW MEXICO","CLOVIS","Elevator",97028.175799999997,155245.08360000001,135839.4461,217343.1171,174650.71650000001,279441.15049999999,232867.622,372588.20069999999,291084.52740000002,465735.25089999998,329895.7978,527833.28430000006,368707.06809999997,589931.31779999996]
[6,"Region VI - Midsouth",null,"NEW MEXICO","FARMINGTON","Detached/Semi-Detached",113795.5672,199142.2427,147787.67370000001,258628.429,176673.883,309179.2953,210769.93789999999,368847.39140000002,248748.23240000001,435309.40669999999,272911.46889999998,477595.07059999998,295678.3885,517437.17979999998]
[6,"Region VI - Midsouth",null,"NEW MEXICO","FARMINGTON","Row House",95082.262499999997,166393.95939999999,126610.8585,221569.0024,155907.07870000001,272837.38789999997,196002.20699999999,343003.86219999997,236996.68489999999,414744.1986,261677.14939999999,457935.01150000002,284784.24780000001,498372.43359999999]
[6,"Region VI - Midsouth",null,"NEW MEXICO","FARMINGTON","Walkup",87529.977199999994,153177.46030000001,120850.00870000001,211487.51519999999,153207.43840000001,268113.0172,199925.8316,349870.20510000002,249004.4094,435757.71649999998,280150.47509999998,490263.33130000002,310813.1238,543922.96660000004]
[6,"Region VI - Midsouth",null,"NEW MEXICO","FARMINGTON","Elevator",98104.607099999994,156967.37359999999,137346.44990000001,219754.32310000001,176588.29259999999,282541.27250000002,235451.0569,376721.69669999997,294313.82120000001,470902.12089999998,333555.66399999999,533689.07039999997,372797.50679999997,596476.01980000001]
[6,"Region VI - Midsouth",null,"NEW MEXICO","GALLUP","Detached/Semi-Detached",110554.0837,193469.6465,143494.3124,251115.04680000001,171468.48149999999,300069.84269999998,204458.68640000001,357802.70110000001,241228.1905,422149.3334,264630.55989999999,463103.47979999997,286652.50170000002,501641.87800000003]
[6,"Region VI - Midsouth",null,"NEW MEXICO","GALLUP","Row House",92825.804399999994,162445.15779999999,123432.0667,216006.11670000001,151794.6672,265640.66769999999,190468.2046,333319.35800000001,230095.14569999999,402666.505,253987.52050000001,444478.16090000002,276331.73710000003,483580.53989999997]
[6,"Region VI - Midsouth",null,"NEW MEXICO","GALLUP","Walkup",85742.407999999996,150049.21419999999,118436.4624,207263.80910000001,150218.57810000001,262882.51169999997,196169.6716,343296.9252,244356.72949999999,427624.27659999998,274991.23729999998,481234.66529999999,305167.77110000001,534043.59939999995]
[6,"Region VI - Midsouth",null,"NEW MEXICO","GALLUP","Elevator",95320.231400000004,152512.3725,133448.32389999999,213517.32139999999,171576.41639999999,274522.27039999998,228768.55530000001,366029.69390000001,285960.69410000002,457537.11739999999,324088.7867,518542.06630000001,362216.87920000002,579547.01540000003]
[6,"Region VI - Midsouth",null,"NEW MEXICO","LAS CRUCES","Detached/Semi-Detached",111947.10249999999,195907.42929999999,145406.84700000001,254461.98209999999,173844.9601,304228.68030000001,207419.04319999999,362983.32539999997,244810.49309999999,428418.36300000001,268598.41269999999,470047.22210000001,291018.35190000001,509282.11599999998]
[6,"Region VI - Midsouth",null,"NEW MEXICO","LAS CRUCES","Row House",93430.752600000007,163503.81709999999,124452.94530000001,217792.6544,153296.7536,268269.31890000001,192806.76190000001,337411.83319999999,233182.64610000001,408069.63059999997,257482.34899999999,450594.11080000002,280238.88640000002,490418.05119999999]
[6,"Region VI - Midsouth",null,"NEW MEXICO","LAS CRUCES","Walkup",85941.058799999999,150396.853,118643.33289999999,207625.8327,150393.13800000001,263187.9914,196219.22829999999,343383.6495,244380.6594,427666.15389999998,274931.85159999999,481130.7402,305004.71539999999,533758.25190000003]
[6,"Region VI - Midsouth",null,"NEW MEXICO","LAS CRUCES","Elevator",96508.619000000006,154413.7928,135112.06659999999,216179.30989999999,173715.51430000001,277944.82699999999,231620.6857,370593.10269999999,289525.85710000002,463241.37839999999,328129.30479999998,525006.89540000004,366732.7524,586772.41260000004]
[6,"Region VI - Midsouth",null,"NEW MEXICO","ROSWELL","Detached/Semi-Detached",113195.4828,198092.0949,147026.59589999999,257296.5429,175779.96109999999,307614.93190000003,209725.61489999999,367019.82610000001,247531.36610000001,433179.89059999998,271583.0307,475270.30369999999,294250.95779999997,514939.17619999999]
[6,"Region VI - Midsouth",null,"NEW MEXICO","ROSWELL","Row House",94482.153099999996,165343.76800000001,125849.7807,220237.11629999999,155013.1568,271273.0245,194957.88399999999,341176.29690000002,235779.8186,412614.6825,260348.71119999999,455610.24459999998,283356.81719999999,495874.43]
[6,"Region VI - Midsouth",null,"NEW MEXICO","ROSWELL","Walkup",86914.274699999994,152099.98079999999,119988.0252,209979.04399999999,152099.17379999999,266173.55420000001,198448.14550000001,347284.25459999999,247157.30179999999,432525.2782,278057.08649999998,486599.90130000003,308473.45419999998,539828.54480000003]
[6,"Region VI - Midsouth",null,"NEW MEXICO","ROSWELL","Elevator",97585.050300000003,156136.0828,136619.0704,218590.516,175653.09049999999,281044.94900000002,234204.1207,374726.59869999997,292755.15090000001,468408.24839999998,331789.17099999997,530862.68149999995,370823.1911,593317.11459999997]
[6,"Region VI - Midsouth",null,"NEW MEXICO","SANTA FE","Detached/Semi-Detached",114443.86320000001,200276.76060000001,148646.3449,260131.10370000001,177714.9621,311001.18369999999,212032.18669999999,371056.32679999998,250252.2389,437941.41820000001,274567.64870000002,480493.38530000002,297483.5637,520596.23629999999]
[6,"Region VI - Midsouth",null,"NEW MEXICO","SANTA FE","Row House",95533.553599999999,167183.71890000001,127246.6161,222681.57819999999,156729.5601,274276.73019999999,197109.0062,344940.76079999999,238376.99110000001,417159.73440000002,263215.07339999999,460626.37839999999,286474.74790000002,501330.8088]
[6,"Region VI - Midsouth",null,"NEW MEXICO","SANTA FE","Walkup",87887.490699999995,153803.10879999999,121332.71739999999,212332.25539999999,153805.20970000001,269159.11690000002,200677.06270000001,351184.85950000002,249933.9443,437384.40240000002,281182.32140000002,492069.0625,311942.19290000002,545898.83770000003]
[6,"Region VI - Midsouth",null,"NEW MEXICO","SANTA FE","Elevator",98661.481499999994,157858.37289999999,138126.0742,221001.72200000001,177590.66680000001,284145.071,236787.55559999999,378860.09470000002,295984.44459999999,473575.11849999998,335449.03720000002,536718.46750000003,374913.6298,599861.81669999997]
[6,"Region VI - Midsouth",null,"OKLAHOMA","ARDMORE","Detached/Semi-Detached",105105.1087,183933.94029999999,136547.01449999999,238957.27540000001,163276.02189999999,285733.03840000002,194841.84729999999,340973.2328,229989.24600000001,402481.18050000002,252346.86629999999,441607.016,273427.87300000002,478498.77769999998]
[6,"Region VI - Midsouth",null,"OKLAHOMA","ARDMORE","Row House",87573.634399999995,153253.8602,116707.68240000001,204238.4442,143820.80549999999,251686.40950000001,181006.81520000001,316761.92660000001,218979.90160000001,383214.82770000002,241822.0828,423188.64490000001,263221.78330000001,460638.12089999998]
[6,"Region VI - Midsouth",null,"OKLAHOMA","ARDMORE","Walkup",80459.270799999998,140803.72390000001,111057.8802,194351.2905,140754.6838,246320.6967,183596.94320000001,321294.65059999999,228650.323,400138.06520000001,257212.26980000001,450121.47210000001,285321.33120000002,499312.3296]
[6,"Region VI - Midsouth",null,"OKLAHOMA","ARDMORE","Elevator",90606.899699999994,144971.0416,126849.65949999999,202959.45819999999,163092.41940000001,260947.87479999999,217456.55910000001,347930.4999,271820.69890000002,434913.12479999999,308063.45880000002,492901.54139999999,344306.21860000002,550889.95810000005]
[6,"Region VI - Midsouth",null,"OKLAHOMA","ENID","Detached/Semi-Detached",105656.9817,184899.71789999999,137210.4988,240118.37289999999,164022.7867,287039.87670000002,195668.2445,342419.4278,230918.97210000001,404108.20120000001,253347.56289999999,443358.2352,274477.55900000001,480335.72830000002]
[6,"Region VI - Midsouth",null,"OKLAHOMA","ENID","Row House",88322.562099999996,154564.48379999999,117594.08040000001,205789.64060000001,144786.1679,253375.79380000001,181988.66209999999,318480.15850000002,220033.32810000001,385058.32410000003,242941.03529999999,425146.81180000002,264386.14449999999,462675.75280000002]
[6,"Region VI - Midsouth",null,"OKLAHOMA","ENID","Walkup",81333.162500000006,142333.0343,112299.13860000001,196523.4926,142373.44149999999,249153.52280000001,185801.08429999999,325151.89740000002,231415.00330000001,404976.25579999998,260367.20069999999,455642.60110000003,288871.60119999998,505525.30219999998]
[6,"Region VI - Midsouth",null,"OKLAHOMA","ENID","Elevator",91089.138699999996,145742.62409999999,127524.7942,204039.67370000001,163960.44959999999,262336.72340000002,218613.93290000001,349782.29790000001,273267.41609999997,437227.87239999999,309703.07160000002,495524.92190000002,346138.72710000002,553821.97160000005]
[6,"Region VI - Midsouth",null,"OKLAHOMA","LAWTON","Detached/Semi-Detached",103663.87850000001,181411.7873,134536.88649999999,235439.5514,160752.38620000001,281316.67580000003,191663.56469999999,335411.23830000003,226119.80309999999,395709.6556,248051.272,434089.72590000002,268684.2782,470197.48680000001]
[6,"Region VI - Midsouth",null,"OKLAHOMA","LAWTON","Row House",87117.504700000005,152455.63310000001,115812.12390000001,202671.2169,142390.15960000001,249182.77929999999,178605.7818,312560.11820000003,215728.9614,377525.68239999999,238117.76860000001,416706.09509999998,259051.56460000001,453340.23790000001]
[6,"Region VI - Midsouth",null,"OKLAHOMA","LAWTON","Walkup",80518.809200000003,140907.916,111230.28449999999,194652.99789999999,141090.61720000001,246908.58009999999,184273.84150000001,322479.22249999997,229543.96580000001,401701.94020000001,258333.19779999999,452083.09610000002,286694.98739999998,501716.2279]
[6,"Region VI - Midsouth",null,"OKLAHOMA","LAWTON","Elevator",89381.194300000003,143009.913,125133.67200000001,200213.8781,160886.14970000001,257417.84330000001,214514.86619999999,343223.79109999997,268143.58279999997,429029.7389,303896.06050000002,486233.70409999997,339648.53820000001,543437.6692]
[6,"Region VI - Midsouth",null,"OKLAHOMA","OKLAHOMA CITY","Detached/Semi-Detached",111347.0145,194857.27530000001,144645.76459999999,253130.08809999999,172951.03289999999,302664.3076,206374.7139,361155.74930000002,243593.61960000001,426288.83419999998,267269.96649999998,467722.44130000001,289590.91279999999,506784.09749999997]
[6,"Region VI - Midsouth",null,"OKLAHOMA","OKLAHOMA CITY","Row House",92830.639599999995,162453.61929999999,123691.863,216460.76029999999,152402.82639999999,266704.94620000001,191762.4326,335584.25709999999,231965.77239999999,405940.1018,256153.90289999999,448269.33,278811.4473,487920.03269999998]
[6,"Region VI - Midsouth",null,"OKLAHOMA","OKLAHOMA CITY","Walkup",85325.352700000003,149319.3671,117781.34420000001,206117.35250000001,149284.86679999999,261248.51689999999,194741.53339999999,340797.68349999998,242533.54070000001,424433.69630000001,272838.45049999998,477467.28830000001,302665.0319,529663.80570000003]
[6,"Region VI - Midsouth",null,"OKLAHOMA","OKLAHOMA CITY","Elevator",95989.059200000003,153582.497,134384.68290000001,215015.4958,172780.30650000001,276448.49459999998,230373.7421,368597.9927,287967.1776,460747.49099999998,326362.80119999999,522180.48969999998,364758.42489999998,583613.48849999998]
[6,"Region VI - Midsouth",null,"OKLAHOMA","TULSA","Detached/Semi-Detached",106857.1505,187000.0134,138732.65429999999,242782.14509999999,165810.6305,290168.60340000002,197756.89050000001,346074.55839999998,233352.70480000001,408367.23330000002,256004.4394,448007.76890000002,277332.4203,485331.73560000001]
[6,"Region VI - Midsouth",null,"OKLAHOMA","TULSA","Row House",89522.781000000003,156664.86679999999,119116.2359,208453.41279999999,146574.0117,256504.52050000001,184077.30799999999,322135.28909999999,222467.0607,389317.35629999998,245597.9118,429796.3456,267241.00579999998,467671.76010000001]
[6,"Region VI - Midsouth",null,"OKLAHOMA","TULSA","Walkup",82564.567500000005,144487.99309999999,114023.1057,199540.43489999999,144589.97070000001,253032.44870000001,188756.45629999999,330323.79859999998,235109.21840000001,411441.1323,264553.97779999999,462969.46110000001,293550.94040000002,513714.14569999999]
[6,"Region VI - Midsouth",null,"OKLAHOMA","TULSA","Elevator",92128.252299999993,147405.2058,128979.55319999999,206367.28810000001,165830.85399999999,265329.37040000001,221107.80540000001,353772.4939,276384.75679999997,442215.61739999999,313236.0576,501177.6997,350087.35859999998,560139.78200000001]
[6,"Region VI - Midsouth",null,"TEXAS","ABILENE","Detached/Semi-Detached",107505.44650000001,188134.5313,139591.32560000001,244284.81969999999,166851.7095,291990.49170000001,199019.13939999999,348283.4939,234856.7113,410999.24489999999,257660.61919999999,450906.08360000001,279137.5956,488490.79210000002]
[6,"Region VI - Midsouth",null,"TEXAS","ABILENE","Row House",89974.072100000005,157454.6262,119751.9935,209565.98860000001,147396.49299999999,257943.8628,185184.1072,324072.1876,223847.36689999999,391732.8921,247135.8357,432487.71250000002,268931.50589999999,470630.13530000002]
[6,"Region VI - Midsouth",null,"TEXAS","ABILENE","Walkup",82922.080900000001,145113.6416,114505.8144,200385.1752,145187.742,254078.5485,189507.6874,331638.45299999998,236038.75330000001,413067.81829999998,265585.82410000003,464775.1923,294680.00959999999,515690.01679999998]
[6,"Region VI - Midsouth",null,"TEXAS","ABILENE","Elevator",92685.126699999993,148296.20499999999,129759.1774,207614.68700000001,166833.22810000001,266933.16899999999,222444.30420000001,355910.89189999999,278055.38020000001,444888.61489999999,315129.43089999998,504207.0968,352203.4816,563525.57889999996]
[6,"Region VI - Midsouth",null,"TEXAS","AMARILLO","Detached/Semi-Detached",108850.2537,190487.94399999999,141406.26670000001,247460.96660000001,169081.03099999999,295891.80430000002,201761.57029999999,353082.74790000002,238151.8737,416765.77909999999,261300.7303,457276.2782,283125.70120000001,495469.97700000001]
[6,"Region VI - Midsouth",null,"TEXAS","AMARILLO","Row House",90727.838600000003,158773.7176,120898.1923,211571.83660000001,148970.01999999999,260697.535,187460.18830000001,328055.32949999999,226771.42739999999,396849.99790000002,250421.17860000001,438237.0625,272575.5857,477007.27500000002]
[6,"Region VI - Midsouth",null,"TEXAS","AMARILLO","Walkup",83378.920800000007,145913.11129999999,115091.9598,201410.92970000001,145872.79500000001,255277.39120000001,190283.6991,332996.47340000002,236980.25589999999,414715.44780000002,266587.98070000001,466528.96610000002,295727.55430000002,517523.22]
[6,"Region VI - Midsouth",null,"TEXAS","AMARILLO","Elevator",93836.1967,150137.91699999999,131370.67540000001,210193.08369999999,168905.15410000001,270248.25050000002,225206.87210000001,360331.00069999998,281508.59009999997,450413.75089999998,319043.06880000001,510468.91769999999,356577.54749999999,570524.08440000005]
[6,"Region VI - Midsouth",null,"TEXAS","AUSTIN","Detached/Semi-Detached",103712.09390000001,181496.1643,134634.48509999999,235610.34890000001,160899.54949999999,281574.21169999999,191881.4981,335792.62160000001,226406.95240000001,396212.1667,248379.02350000001,434663.29100000003,269062.03350000002,470858.55859999999]
[6,"Region VI - Midsouth",null,"TEXAS","AUSTIN","Row House",86968.688899999994,152195.20569999999,115686.8075,202451.91320000001,142318.72399999999,249057.76689999999,178668.26459999999,312669.46299999999,215892.40950000001,377811.71659999999,238327.2635,417072.71110000001,259314.6441,453800.62719999999]
[6,"Region VI - Midsouth",null,"TEXAS","AUSTIN","Walkup",80260.622199999998,140456.0889,110851.0125,193989.27189999999,140580.12760000001,246015.22330000001,183547.391,321207.93410000001,228626.39869999999,400096.19760000001,257271.66159999999,450225.40789999999,285484.39360000001,499597.68890000001]
[6,"Region VI - Midsouth",null,"TEXAS","AUSTIN","Elevator",89418.515299999999,143069.62659999999,125185.92140000001,200297.47719999999,160953.32750000001,257525.3279,214604.43669999999,343367.10389999999,268255.54580000002,429208.8798,304022.95199999999,486436.7304,339790.35810000001,543664.58109999995]
[6,"Region VI - Midsouth",null,"TEXAS","BEAUMONT","Detached/Semi-Detached",108753.8268,190319.19699999999,141211.07459999999,247119.3805,168786.71049999999,295376.74339999998,201325.71109999999,352319.99449999997,237577.58429999999,415760.77240000002,260645.23730000001,456129.16529999999,282370.20130000002,494147.85239999997]
[6,"Region VI - Midsouth",null,"TEXAS","BEAUMONT","Row House",91025.472599999994,159294.57709999999,121148.82889999999,212010.45050000001,149112.89619999999,260947.56839999999,187335.22940000001,327836.65139999997,226444.53950000001,396277.94400000002,250002.1979,437503.84639999998,272049.43660000002,476086.51419999998]
[6,"Region VI - Midsouth",null,"TEXAS","BEAUMONT","Walkup",83895.296799999996,146816.76949999999,115850.50659999999,202738.3866,146893.77789999999,257064.11120000001,191736.60459999999,335539.05800000002,238815.39569999999,417926.9425,268711.05900000001,470244.35330000002,298148.74839999998,521760.30969999998]
[6,"Region VI - Midsouth",null,"TEXAS","BEAUMONT","Elevator",93761.558000000005,150018.495,131266.18109999999,210025.89300000001,168770.80429999999,270033.29090000002,225027.73910000001,360044.38799999998,281284.67389999999,450055.48499999999,318789.29710000003,510062.88290000003,356293.9203,570070.28090000001]
[6,"Region VI - Midsouth",null,"TEXAS","CORPUS CHRISTI","Detached/Semi-Detached",108753.8268,190319.19699999999,141211.07459999999,247119.3805,168786.71049999999,295376.74339999998,201325.71109999999,352319.99449999997,237577.58429999999,415760.77240000002,260645.23730000001,456129.16529999999,282370.20130000002,494147.85239999997]
[6,"Region VI - Midsouth",null,"TEXAS","CORPUS CHRISTI","Row House",91025.472599999994,159294.57709999999,121148.82889999999,212010.45050000001,149112.89619999999,260947.56839999999,187335.22940000001,327836.65139999997,226444.53950000001,396277.94400000002,250002.1979,437503.84639999998,272049.43660000002,476086.51419999998]
[6,"Region VI - Midsouth",null,"TEXAS","CORPUS CHRISTI","Walkup",83895.296799999996,146816.76949999999,115850.50659999999,202738.3866,146893.77789999999,257064.11120000001,191736.60459999999,335539.05800000002,238815.39569999999,417926.9425,268711.05900000001,470244.35330000002,298148.74839999998,521760.30969999998]
[6,"Region VI - Midsouth",null,"TEXAS","CORPUS CHRISTI","Elevator",93761.558000000005,150018.495,131266.18109999999,210025.89300000001,168770.80429999999,270033.29090000002,225027.73910000001,360044.38799999998,281284.67389999999,450055.48499999999,318789.29710000003,510062.88290000003,356293.9203,570070.28090000001]
[6,"Region VI - Midsouth",null,"TEXAS","DALLAS","Detached/Semi-Detached",110650.51059999999,193638.39350000001,143689.50450000001,251456.63279999999,171762.802,300584.90360000002,204894.54560000001,358565.4546,241802.48,423154.34,265286.05290000001,464250.59269999998,287408.00160000002,502964.00280000002]
[6,"Region VI - Midsouth",null,"TEXAS","DALLAS","Row House",92528.170499999993,161924.29829999999,123181.4302,215567.50279999999,151651.791,265390.63429999998,190593.1635,333538.03610000003,230422.0337,403238.5589,254406.50109999999,445211.37699999998,276857.8861,484501.30070000002]
[6,"Region VI - Midsouth",null,"TEXAS","DALLAS","Walkup",85226.032000000007,149145.55600000001,117677.91559999999,205936.35219999999,149197.59529999999,261095.7917,194716.76610000001,340754.3407,242521.58970000001,424412.7819,272868.15889999998,477519.2781,302746.57709999999,529806.50970000005]
[6,"Region VI - Midsouth",null,"TEXAS","DALLAS","Elevator",95394.8701,152631.79440000001,133552.81820000001,213684.5122,171710.76620000001,274737.23,228947.6882,366316.30660000001,286184.6103,457895.38329999999,324342.55839999998,518948.10100000002,362500.50630000001,580000.81889999995]
[6,"Region VI - Midsouth",null,"TEXAS","EL PASO","Detached/Semi-Detached",106857.1505,187000.0134,138732.65429999999,242782.14509999999,165810.6305,290168.60340000002,197756.89050000001,346074.55839999998,233352.70480000001,408367.23330000002,256004.4394,448007.76890000002,277332.4203,485331.73560000001]
[6,"Region VI - Midsouth",null,"TEXAS","EL PASO","Row House",89522.781000000003,156664.86679999999,119116.2359,208453.41279999999,146574.0117,256504.52050000001,184077.30799999999,322135.28909999999,222467.0607,389317.35629999998,245597.9118,429796.3456,267241.00579999998,467671.76010000001]
[6,"Region VI - Midsouth",null,"TEXAS","EL PASO","Walkup",82564.567500000005,144487.99309999999,114023.1057,199540.43489999999,144589.97070000001,253032.44870000001,188756.45629999999,330323.79859999998,235109.21840000001,411441.1323,264553.97779999999,462969.46110000001,293550.94040000002,513714.14569999999]
[6,"Region VI - Midsouth",null,"TEXAS","EL PASO","Elevator",92128.252299999993,147405.2058,128979.55319999999,206367.28810000001,165830.85399999999,265329.37040000001,221107.80540000001,353772.4939,276384.75679999997,442215.61739999999,313236.0576,501177.6997,350087.35859999998,560139.78200000001]
[6,"Region VI - Midsouth",null,"TEXAS","FORT WORTH","Detached/Semi-Detached",108802.04210000001,190403.57380000001,141308.67310000001,247290.17800000001,168933.87390000001,295634.27929999999,201543.64439999999,352701.37780000002,237864.7334,416263.28350000002,260972.98879999999,456702.7304,282747.95669999998,494808.9241]
[6,"Region VI - Midsouth",null,"TEXAS","FORT WORTH","Row House",90876.657000000007,159034.14970000001,121023.51240000001,211791.14679999999,149041.46059999999,260822.55600000001,187397.7121,327945.9963,226607.98749999999,396563.97820000001,250211.69279999999,437870.46240000002,272312.51620000001,476546.90340000001]
[6,"Region VI - Midsouth",null,"TEXAS","FORT WORTH","Walkup",83637.109800000006,146364.9423,115471.2346,202074.66070000001,146383.28829999999,256170.75440000001,191010.15410000001,334267.7696,237897.82860000001,416321.2,267649.52289999998,468386.66519999999,296938.15470000001,519641.77069999999]
[6,"Region VI - Midsouth",null,"TEXAS","FORT WORTH","Elevator",93798.879000000001,150078.20860000001,131318.43059999999,210109.4921,168837.98209999999,270140.77549999999,225117.30960000001,360187.70069999999,281396.63699999999,450234.62589999998,318916.18859999999,510265.9093,356435.7402,570297.19279999996]
[6,"Region VI - Midsouth",null,"TEXAS","GALVESTON","Detached/Semi-Detached",104505.02069999999,182883.78630000001,135785.93220000001,237625.38130000001,162382.09469999999,284168.66580000002,193797.51809999999,339145.65669999999,228772.37239999999,400351.65179999999,251018.42009999999,439282.2353,272000.4338,476000.75919999997]
[6,"Region VI - Midsouth",null,"TEXAS","GALVESTON","Row House",86973.521399999998,152203.66250000001,115946.6001,202906.55009999999,142926.87830000001,250122.03690000001,179962.486,314934.3505,217763.02799999999,381085.299,240493.6367,420863.86410000001,261794.34419999999,458140.10239999997]
[6,"Region VI - Midsouth",null,"TEXAS","GALVESTON","Walkup",79843.564599999998,139726.23809999999,110195.8916,192842.81030000001,139646.41269999999,244381.22210000001,182119.24830000001,318708.68459999998,226803.20439999999,396905.6078,255118.86869999999,446458.02029999997,282981.64760000003,495217.88339999999]
[6,"Region VI - Midsouth",null,"TEXAS","GALVESTON","Elevator",90087.339800000002,144139.74590000001,126122.2757,201795.6441,162157.21160000001,259451.54250000001,216209.61550000001,345935.38990000001,270262.01939999999,432419.23739999998,306296.95520000003,490075.13569999998,342331.89120000001,547731.03410000005]
[6,"Region VI - Midsouth",null,"TEXAS","HOUSTON","Detached/Semi-Detached",108802.04210000001,190403.57380000001,141308.67310000001,247290.17800000001,168933.87390000001,295634.27929999999,201543.64439999999,352701.37780000002,237864.7334,416263.28350000002,260972.98879999999,456702.7304,282747.95669999998,494808.9241]
[6,"Region VI - Midsouth",null,"TEXAS","HOUSTON","Row House",90876.657000000007,159034.14970000001,121023.51240000001,211791.14679999999,149041.46059999999,260822.55600000001,187397.7121,327945.9963,226607.98749999999,396563.97820000001,250211.69279999999,437870.46240000002,272312.51620000001,476546.90340000001]
[6,"Region VI - Midsouth",null,"TEXAS","HOUSTON","Walkup",83637.109800000006,146364.9423,115471.2346,202074.66070000001,146383.28829999999,256170.75440000001,191010.15410000001,334267.7696,237897.82860000001,416321.2,267649.52289999998,468386.66519999999,296938.15470000001,519641.77069999999]
[6,"Region VI - Midsouth",null,"TEXAS","HOUSTON","Elevator",93798.879000000001,150078.20860000001,131318.43059999999,210109.4921,168837.98209999999,270140.77549999999,225117.30960000001,360187.70069999999,281396.63699999999,450234.62589999998,318916.18859999999,510265.9093,356435.7402,570297.19279999996]
[6,"Region VI - Midsouth",null,"TEXAS","LAREDO","Detached/Semi-Detached",98573.930200000003,172504.37779999999,127862.69839999999,223759.72219999999,152718.0618,267256.60820000002,182001.4184,318502.48210000002,214662.022,375658.53850000002,235457.30669999999,412050.2867,254998.35500000001,446247.1213]
[6,"Region VI - Midsouth",null,"TEXAS","LAREDO","Row House",83209.536600000007,145616.68909999999,110475.41899999999,193331.98319999999,135667.42300000001,237417.9902,169876.33429999999,297283.58500000002,205013.38329999999,358773.42070000002,226233.33929999999,395908.34379999997,246053.6924,430593.96169999999]
[6,"Region VI - Midsouth",null,"TEXAS","LAREDO","Walkup",77142.321500000005,134999.06270000001,106610.0624,186567.60920000001,135287.4566,236753.04889999999,176811.07829999999,309419.38709999999,220272.53589999999,385476.93780000001,247955.3365,433921.83889999997,275241.22629999998,481672.14600000001]
[6,"Region VI - Midsouth",null,"TEXAS","LAREDO","Elevator",85000.830600000001,136001.33100000001,119001.16280000001,190401.8633,153001.495,244802.39559999999,204001.99340000001,326403.19420000003,255002.49170000001,408003.99280000001,289002.82390000002,462404.52510000003,323003.15610000002,516805.0576]
[6,"Region VI - Midsouth",null,"TEXAS","LONGVIEW","Detached/Semi-Detached",106498.12390000001,186371.7169,138459.54440000001,242304.2028,165652.49530000001,289891.86670000001,197802.19779999999,346153.84620000003,233571.54139999999,408750.1974,256314.71109999999,448550.74440000003,277793.71470000001,486139.00069999998]
[6,"Region VI - Midsouth",null,"TEXAS","LONGVIEW","Row House",88178.578999999998,154312.51319999999,117728.55650000001,206024.97390000001,145322.88649999999,254315.0514,183345.36619999999,320854.39079999999,222067.3947,388617.94069999998,245316.90349999999,429304.5809,267128.9241,467475.61729999998]
[6,"Region VI - Midsouth",null,"TEXAS","LONGVIEW","Walkup",80657.9179,141151.35630000001,111264.7457,194713.30489999999,140929.23699999999,246626.16469999999,183646.49110000001,321381.35940000002,228674.24179999999,400179.92320000002,257152.87160000001,450017.52529999998,285158.26150000002,499026.95760000002]
[6,"Region VI - Midsouth",null,"TEXAS","LONGVIEW","Elevator",91795.284199999995,146872.45699999999,128513.3979,205621.43969999999,165231.5116,264370.42249999999,220308.68220000001,352493.89669999998,275385.85269999999,440617.37089999998,312103.96639999998,499366.35369999998,348822.08,558115.33640000003]
[6,"Region VI - Midsouth",null,"TEXAS","LUBBOCK","Detached/Semi-Detached",106905.36199999999,187084.3835,138830.24780000001,242952.93359999999,165957.78769999999,290426.12839999999,197974.81640000001,346455.92859999998,233639.84510000001,408869.72879999998,256332.18100000001,448581.31670000002,277710.16489999997,485992.78850000002]
[6,"Region VI - Midsouth",null,"TEXAS","LUBBOCK","Row House",89373.962700000004,156404.43470000001,118990.9158,208234.10250000001,146502.57120000001,256379.49950000001,184139.78419999999,322244.62239999999,222630.5006,389603.37609999999,245807.39749999999,430162.94569999998,267504.07520000002,468132.13160000002]
[6,"Region VI - Midsouth",null,"TEXAS","LUBBOCK","Walkup",82306.378400000001,144036.16209999999,113643.8308,198876.7041,144079.47750000001,252139.08549999999,188030.00140000001,329052.5024,234191.64569999999,409835.38,263492.43550000002,461111.7622,292340.34000000003,511595.59499999997]
[6,"Region VI - Midsouth",null,"TEXAS","LUBBOCK","Elevator",92165.57,147464.9142,129031.79790000001,206450.87969999999,165898.02600000001,265436.84539999999,221197.36790000001,353915.79389999999,276496.70990000002,442394.74239999999,313362.93780000001,501380.70799999998,350229.16580000002,560366.67370000004]
[6,"Region VI - Midsouth",null,"TEXAS","MIDLAND","Detached/Semi-Detached",108657.4074,190150.46290000001,141015.8922,246777.81140000001,168492.40150000001,294861.70260000002,200889.86569999999,351557.26500000001,237003.31099999999,414755.79430000001,259989.76199999999,454982.08350000001,281614.72070000001,492825.76130000001]
[6,"Region VI - Midsouth",null,"TEXAS","MIDLAND","Row House",91323.112899999993,159815.44760000001,121399.47380000001,212449.0791,149255.78270000001,261197.61979999999,187210.28330000001,327617.99579999998,226117.66699999999,395705.91720000003,249583.23439999999,436770.66019999998,271523.30619999999,475165.78580000001]
[6,"Region VI - Midsouth",null,"TEXAS","MIDLAND","Walkup",84411.678799999994,147720.43780000001,116609.06140000001,204065.85750000001,147914.7709,258850.84909999999,193189.52340000001,338081.66580000002,240650.55220000001,421138.46629999997,270834.15600000002,473959.77309999999,300569.9632,525997.43550000002]
[6,"Region VI - Midsouth",null,"TEXAS","MIDLAND","Elevator",93686.925700000007,149899.0833,131161.69589999999,209858.71660000001,168636.46609999999,269818.34989999997,224848.62160000001,359757.79989999998,281060.777,449697.2499,318535.54719999997,509656.88319999998,356010.3175,569616.51639999996]
[6,"Region VI - Midsouth",null,"TEXAS","SAN ANGELO","Detached/Semi-Detached",102511.925,179395.86869999999,133112.3296,232946.57670000001,159111.70569999999,278445.48509999999,189792.85209999999,332137.49119999999,223973.21969999999,391953.13449999999,245722.147,430013.7573,266207.17229999998,465862.5514]
[6,"Region VI - Midsouth",null,"TEXAS","SAN ANGELO","Row House",85768.470100000006,150094.82269999999,114164.65210000001,199788.141,140530.88020000001,245929.04019999999,176579.61859999999,309014.33250000002,213458.67679999999,373552.68430000002,235670.38699999999,412423.17729999998,256459.78279999999,448804.62]
[6,"Region VI - Midsouth",null,"TEXAS","SAN ANGELO","Walkup",79029.217099999994,138301.13,109127.04549999999,190972.32949999999,138363.59839999999,242136.29740000001,180592.01879999999,316036.03289999999,224932.18350000001,393631.3211,253084.88449999999,442898.5478,280805.05440000002,491408.84529999999]
[6,"Region VI - Midsouth",null,"TEXAS","SAN ANGELO","Elevator",88379.401800000007,141407.04500000001,123731.16250000001,197969.86290000001,159082.92310000001,254532.6808,212110.56419999999,339376.90779999999,265138.20520000003,424221.1348,300489.96590000001,480783.95270000002,335841.7267,537346.77069999999]
[6,"Region VI - Midsouth",null,"TEXAS","SAN ANTONIO","Detached/Semi-Detached",102367.28660000001,179142.75150000001,132819.54399999999,232434.20199999999,158670.22810000001,277672.89909999998,189139.06709999999,330993.36749999999,223111.79,390445.63250000001,244738.9123,428293.09659999999,265073.9278,463879.3737]
[6,"Region VI - Midsouth",null,"TEXAS","SAN ANTONIO","Row House",86214.922500000001,150876.11429999999,114540.6087,200446.06529999999,140745.19699999999,246304.09469999999,176392.18350000001,308686.3211,212968.34899999999,372694.61070000002,235041.92069999999,411323.36129999999,255670.5643,447423.48749999999]
[6,"Region VI - Midsouth",null,"TEXAS","SAN ANTONIO","Walkup",79803.782399999996,139656.61910000001,110264.86719999999,192963.51749999999,139895.07449999999,244816.38039999999,182771.3792,319849.91369999998,227684.89610000001,398448.56819999998,256269.50520000001,448471.63390000002,284436.84899999999,497764.48570000002]
[6,"Region VI - Midsouth",null,"TEXAS","SAN ANTONIO","Elevator",88267.445300000007,141227.91459999999,123574.4235,197719.08050000001,158881.40160000001,254210.24619999999,211841.86869999999,338946.9951,264802.33590000001,423683.7439,300109.31410000002,480174.90960000001,335416.29220000003,536666.07550000004]
[6,"Region VI - Midsouth",null,"TEXAS","TYLER","Detached/Semi-Detached",105056.89720000001,183849.57019999999,136449.42110000001,238786.48680000001,163128.86480000001,285475.5135,194623.9215,340591.86259999999,229702.10569999999,401978.6851,252019.12469999999,441033.4682,273050.12839999999,477837.72470000002]
[6,"Region VI - Midsouth",null,"TEXAS","TYLER","Row House",87722.452699999994,153514.29240000001,116833.00260000001,204457.75450000001,143892.24600000001,251811.43049999999,180944.33910000001,316652.59330000001,218816.46170000001,382928.80800000002,241612.59710000001,422822.04499999998,262958.71389999997,460177.74920000002]
[6,"Region VI - Midsouth",null,"TEXAS","TYLER","Walkup",80717.459900000002,141255.55480000001,111437.1551,195015.0214,141265.177,247214.05979999999,184323.3982,322565.94679999998,229567.89569999999,401743.8174,258273.81210000001,451979.17109999998,286531.93160000001,501430.88030000002]
[6,"Region VI - Midsouth",null,"TEXAS","TYLER","Elevator",90569.581999999995,144911.3333,126797.41469999999,202875.86660000001,163025.24739999999,260840.39989999999,217366.99660000001,347787.1998,271708.74579999998,434733.9999,307936.57860000001,492698.5331,344164.41139999998,550663.06649999996]
[6,"Region VI - Midsouth",null,"TEXAS","VICTORIA","Detached/Semi-Detached",98718.564899999998,172757.48869999999,128155.4794,224272.08900000001,153159.53419999999,268029.18489999999,182655.19709999999,319646.59490000003,215523.44450000001,377166.02789999999,236440.53339999999,413770.93349999998,256131.59099999999,448230.28419999999]
[6,"Region VI - Midsouth",null,"TEXAS","VICTORIA","Row House",82763.080700000006,144835.39120000001,110099.4578,192674.05110000001,135453.10079999999,237042.9264,170063.76319999999,297611.58549999999,205503.70379999999,359631.4817,226861.7977,397008.1459,246842.90239999999,431975.07929999998]
[6,"Region VI - Midsouth",null,"TEXAS","VICTORIA","Walkup",76367.752600000007,133643.56709999999,105472.2356,184576.4123,133755.97390000001,234072.95430000001,174631.70910000001,305605.49089999998,217519.81229999999,380659.6715,244770.70329999999,428348.73090000002,271609.4179,475316.48129999998]
[6,"Region VI - Midsouth",null,"TEXAS","VICTORIA","Elevator",85112.783899999995,136180.45629999999,119157.89750000001,190652.63879999999,153203.011,245124.82130000001,204270.6813,326833.09509999998,255338.3517,408541.3689,289383.46529999998,463013.5514,323428.57880000002,517485.73389999999]
[6,"Region VI - Midsouth",null,"TEXAS","WACO","Detached/Semi-Detached",106808.939,186915.6433,138635.06090000001,242611.35649999999,165663.47330000001,289911.0784,197538.96470000001,345693.18829999998,233065.56460000001,407864.73790000001,255676.69779999999,447434.22110000002,276954.67570000002,484670.6826]
[6,"Region VI - Midsouth",null,"TEXAS","WACO","Row House",89671.599400000006,156925.29889999999,119241.5561,208672.7231,146645.4523,256629.54139999999,184014.83189999999,322025.9559,222303.62090000001,389031.33649999998,245388.42610000001,429429.74560000002,266977.9363,467211.3885]
[6,"Region VI - Midsouth",null,"TEXAS","WACO","Walkup",82822.756599999993,144939.82399999999,114402.3806,200204.16589999999,145100.4639,253925.81169999999,189482.91140000001,331595.09480000002,236026.7911,413046.88449999999,265615.52,464827.16009999998,294761.54080000002,515832.69640000002]
[6,"Region VI - Midsouth",null,"TEXAS","WACO","Elevator",92090.934599999993,147345.4975,128927.30839999999,206283.69649999999,165763.68220000001,265221.89549999998,221018.24290000001,353629.19390000001,276272.80369999999,442036.49239999999,313109.17749999999,500974.69130000001,349945.55129999999,559912.89040000003]
[6,"Region VI - Midsouth",null,"TEXAS","WICHITA FALLS","Detached/Semi-Detached",107457.2349,188050.1611,139493.73209999999,244114.0312,166704.55239999999,291732.96669999999,198801.21350000001,347902.1237,234569.5711,410496.74949999998,257332.87760000001,450332.53580000001,278759.85090000002,487829.73920000001]
[6,"Region VI - Midsouth",null,"TEXAS","WICHITA FALLS","Row House",90122.890499999994,157715.05840000001,119877.3137,209785.29889999999,147467.93359999999,258068.88380000001,185121.63099999999,323962.85430000001,223683.927,391446.87239999999,246926.35,432121.11259999999,268668.43640000001,470169.76370000001]
[6,"Region VI - Midsouth",null,"TEXAS","WICHITA FALLS","Walkup",83180.270099999994,145565.47260000001,114885.08930000001,201048.90609999999,145698.2352,254971.91159999999,190234.14249999999,332909.74920000002,236956.326,414673.57049999997,266647.3664,466632.89110000001,295890.61,517808.5675]
[6,"Region VI - Midsouth",null,"TEXAS","WICHITA FALLS","Elevator",92647.808999999994,148236.49660000001,129706.9327,207531.09529999999,166766.05619999999,266825.69390000001,222354.74170000001,355767.5919,277943.42700000003,444709.49,315002.55060000002,504004.08850000001,352061.67420000001,563298.68720000004]
[7,"Region VII - Midwest",null,"IOWA","BURLINGTON","Detached/Semi-Detached",116892.41620000001,204561.72839999999,151788.25459999999,265629.44559999998,181437.81299999999,317516.1728,216427.41209999999,378747.97110000002,255406.8535,446961.99369999999,280209.1532,490366.01799999998,303571.04149999999,531249.32259999996]
[7,"Region VII - Midwest",null,"IOWA","BURLINGTON","Row House",97785.175700000007,171124.05729999999,130165.61079999999,227789.81890000001,160233.81200000001,280409.17109999998,201348.78090000001,352360.3665,243407.90460000001,425963.83299999998,268738.32120000001,470292.06209999998,292447.55009999999,511783.21250000002]
[7,"Region VII - Midwest",null,"IOWA","BURLINGTON","Walkup",90092.113800000006,157661.1992,124401.3796,217702.4143,157727.7782,276023.61190000002,205861.35630000001,360257.3737,256404.80739999999,448708.413,288494.33960000001,504865.0944,320090.27769999998,560157.98589999997]
[7,"Region VII - Midwest",null,"IOWA","BURLINGTON","Elevator",100777.02959999999,161243.24979999999,141087.84150000001,225740.54980000001,181398.65330000001,290237.84960000002,241864.87109999999,386983.79950000002,302331.08889999997,483729.74949999998,342641.9007,548227.04929999996,382952.71260000003,612724.3493]
[7,"Region VII - Midwest",null,"IOWA","CEDAR RAPIDS","Detached/Semi-Detached",120589.34940000001,211031.36139999999,156549.91269999999,273962.34720000002,187095.66399999999,327417.41200000001,223129.20790000001,390476.1139,263282.33929999999,460744.09379999997,288835.27360000001,505461.72889999999,312891.12290000002,547559.46499999997]
[7,"Region VII - Midwest",null,"IOWA","CEDAR RAPIDS","Row House",101088.19899999999,176904.34839999999,134481.44159999999,235342.52290000001,165454.4676,289545.31819999998,207739.67739999999,363544.43550000002,251035.9896,439312.9817,277127.93,484973.8774,301538.28139999998,527691.99230000004]
[7,"Region VII - Midwest",null,"IOWA","CEDAR RAPIDS","Walkup",93269.954500000007,163222.42019999999,128814.7363,225425.7885,163356.38570000001,285873.67499999999,213274.5716,373230.50030000001,265652.31849999999,464891.55739999999,298931.59909999999,523130.29849999998,331707.10830000002,580487.43960000004]
[7,"Region VII - Midwest",null,"IOWA","CEDAR RAPIDS","Elevator",103969.00870000001,166350.41649999999,145556.61230000001,232890.58309999999,187144.21580000001,299430.74969999999,249525.62100000001,399240.99959999998,311907.02630000003,499051.24949999998,353494.6298,565591.41599999997,395082.23320000002,632131.58259999997]
[7,"Region VII - Midwest",null,"IOWA","COUNCIL BLUFFS","Detached/Semi-Detached",111298.80650000001,194772.91140000001,144548.17569999999,252959.3075,172803.8811,302406.79190000001,206156.79440000001,360774.39,243306.4866,425786.35149999999,266942.2328,467148.90740000003,289213.17680000002,506123.05940000003]
[7,"Region VII - Midwest",null,"IOWA","COUNCIL BLUFFS","Row House",92979.461599999995,162714.0577,123817.18769999999,216680.07860000001,152474.27239999999,266829.97659999999,191699.9627,335474.93459999998,231802.33979999999,405654.09470000002,255944.42509999999,447902.7439,278548.38620000001,487459.67599999998]
[7,"Region VII - Midwest",null,"IOWA","COUNCIL BLUFFS","Walkup",85583.545400000003,149771.20439999999,118160.6243,206781.09239999999,149795.36660000001,262141.8916,195467.99720000001,342068.9951,243451.12450000001,426039.46789999999,273900.00520000001,479325.00919999997,303875.64620000002,531782.38080000004]
[7,"Region VII - Midwest",null,"IOWA","COUNCIL BLUFFS","Elevator",95951.744600000005,153522.79370000001,134332.4424,214931.91099999999,172713.14019999999,276341.02850000001,230284.18700000001,368454.7047,287855.23379999999,460568.38089999999,326235.93150000001,521977.49819999997,364616.62939999998,583386.61569999997]
[7,"Region VII - Midwest",null,"IOWA","DAVENPORT","Detached/Semi-Detached",127575.98149999999,223257.9676,165702.5307,289979.42869999999,198106.07990000001,346685.6398,236360.18859999999,413630.33010000002,278965.01610000001,488188.7782,306070.05469999998,535622.59569999995,331614.84629999998,580325.98100000003]
[7,"Region VII - Midwest",null,"IOWA","DAVENPORT","Row House",106498.8649,186373.01360000001,141850.74789999999,248238.8088,174716.09899999999,305753.17320000002,219727.05910000001,384522.35340000002,265729.06180000002,465025.85820000002,293416.66249999998,513479.1593,319344.6029,558853.0551]
[7,"Region VII - Midwest",null,"IOWA","DAVENPORT","Walkup",97977.177200000006,171460.06020000001,135262.36730000001,236709.14290000001,171463.36369999999,300060.88660000003,223717.49619999999,391505.61849999998,278629.9423,487602.39899999998,313466.56030000001,548566.48049999995,347758.69809999998,608577.72160000005]
[7,"Region VII - Midwest",null,"IOWA","DAVENPORT","Elevator",109982.68459999999,175972.29800000001,153975.75839999999,246361.21720000001,197968.83230000001,316750.13630000001,263958.44300000003,422333.51510000002,329948.05379999999,527916.89379999996,373941.12760000001,598305.81299999997,417934.20140000002,668694.73230000003]
[7,"Region VII - Midwest",null,"IOWA","DES MOINES","Detached/Semi-Detached",119892.842,209812.47339999999,155593.64799999999,272288.88400000002,185907.42790000001,325337.9987,221649.03330000001,387885.80829999998,261491.1925,457609.58679999999,286851.35220000002,501989.8664,310708.20319999999,543739.35549999995]
[7,"Region VII - Midwest",null,"IOWA","DES MOINES","Row House",100785.72629999999,176375.02110000001,133971.0042,234449.2573,164703.42679999999,288230.99699999997,206570.40210000001,361498.20370000001,249492.24350000001,436611.42609999998,275380.52029999997,481915.9105,299584.71169999999,524273.24550000002]
[7,"Region VII - Midwest",null,"IOWA","DES MOINES","Walkup",93170.630099999995,163048.60269999999,128711.30250000001,225244.77919999999,163269.10750000001,285720.93829999998,213249.79550000001,373187.1421,265640.35639999999,464870.62359999999,298961.29509999999,523182.26630000002,331788.63959999999,580630.11930000002]
[7,"Region VII - Midwest",null,"IOWA","DES MOINES","Elevator",103374.81660000001,165399.70910000001,144724.7432,231559.5926,186074.6698,297719.47619999998,248099.55970000001,396959.3015,310124.4498,496199.12699999998,351474.3763,562359.01049999997,392824.30300000001,628518.89410000003]
[7,"Region VII - Midwest",null,"IOWA","DUBUQUE","Detached/Semi-Detached",119030.1502,208302.76269999999,154754.6421,270820.6238,185149.67879999999,324011.93790000002,221085.86180000001,386900.25809999998,261067.43419999999,456868.0099,286488.65909999999,501355.15330000001,310497.5453,543370.70420000004]
[7,"Region VII - Midwest",null,"IOWA","DUBUQUE","Row House",98543.775500000003,172451.60709999999,131571.6029,230250.3051,162415.49369999999,284227.114,204919.08300000001,358608.39520000003,248202.58259999999,434354.51949999999,274190.03590000002,479832.56280000001,298571.3284,522499.8247]
[7,"Region VII - Midwest",null,"IOWA","DUBUQUE","Walkup",90131.897599999997,157730.82079999999,124332.4063,217581.71100000001,157479.1194,275588.45899999997,205209.2297,359116.152,255523.12119999999,447165.4621,287343.7096,502851.49170000001,318635.08350000001,557611.39619999996]
[7,"Region VII - Midwest",null,"IOWA","DUBUQUE","Elevator",102596.92389999999,164155.08069999999,143635.69339999999,229817.11300000001,184674.46299999999,295479.14510000002,246232.61730000001,393972.1936,307790.77169999998,492465.24190000002,348829.54119999998,558127.27419999999,389868.31079999998,623789.30649999995]
[7,"Region VII - Midwest",null,"IOWA","FORT DODGE","Detached/Semi-Detached",113340.1176,198345.2058,147319.3769,257808.90960000001,176221.43350000001,308387.5086,210379.39369999999,368163.93890000001,248392.7885,434687.3799,272566.25750000001,476990.95059999998,295384.1937,516922.33899999998]
[7,"Region VII - Midwest",null,"IOWA","FORT DODGE","Row House",94035.697199999995,164562.47010000001,125473.81939999999,219579.18410000001,154798.83480000001,270897.9608,195145.31280000001,341504.29739999998,236270.13920000001,413472.74349999998,260977.16959999999,456710.04680000001,284146.02720000001,497255.54759999999]
[7,"Region VII - Midwest",null,"IOWA","FORT DODGE","Walkup",86139.705799999996,150744.4853,118850.19839999999,207987.84719999999,150567.6911,263493.4595,196268.77619999999,343470.35830000002,244404.57819999999,427708.01189999998,274872.4534,481026.79340000002,304841.64569999999,533472.87990000006]
[7,"Region VII - Midwest",null,"IOWA","FORT DODGE","Elevator",97697.003599999996,156315.20809999999,136775.80499999999,218841.29139999999,175854.60649999999,281367.37469999999,234472.80869999999,375156.49949999998,293091.01089999999,468945.62439999997,332169.8124,531471.70759999997,371248.61379999999,593997.79090000002]
[7,"Region VII - Midwest",null,"IOWA","MASON CITY","Detached/Semi-Detached",118526.48510000001,207421.34899999999,154188.74679999999,269830.30690000003,184550.06589999999,322962.61540000001,220477.3841,385835.42219999997,260424.84109999999,455743.47200000001,285815.6961,500177.4682,309825.59519999998,542194.7916]
[7,"Region VII - Midwest",null,"IOWA","MASON CITY","Row House",97646.025800000003,170880.54509999999,130559.8803,228479.7905,161378.68539999999,282412.69939999998,203999.70610000001,356999.48560000001,247312.58869999999,432797.03029999998,273280.5612,478240.98210000002,297670.0282,520922.54940000002]
[7,"Region VII - Midwest",null,"IOWA","MASON CITY","Walkup",88999.813200000004,155749.67310000001,122711.8679,214745.7689,155349.86180000001,271862.25819999998,202278.6249,353987.59360000002,251840.8573,440721.5001,283127.22399999999,495472.64199999999,313874.19919999997,549279.84849999996]
[7,"Region VII - Midwest",null,"IOWA","MASON CITY","Elevator",102151.99950000001,163443.2015,143012.79920000001,228820.48209999999,183873.59899999999,294197.76270000002,245164.79860000001,392263.68359999999,306455.99829999998,490329.60450000002,347316.79800000001,555706.88509999996,388177.59779999999,621084.16579999996]
[7,"Region VII - Midwest",null,"IOWA","SIOUX CITY","Detached/Semi-Detached",114299.22870000001,200023.6501,148353.56460000001,259618.73800000001,177273.49059999999,310228.60859999998,211378.4094,369912.21629999997,249390.81830000001,436433.93190000003,273584.424,478772.74190000002,296350.33,518613.07740000001]
[7,"Region VII - Midwest",null,"IOWA","SIOUX CITY","Row House",95980.008700000006,167965.01509999999,127622.5766,223339.5091,156943.88190000001,274651.79320000001,196921.57769999999,344612.76089999999,237886.6715,416301.6752,262586.61629999999,459526.5784,285685.53940000001,499949.69400000002]
[7,"Region VII - Midwest",null,"IOWA","SIOUX CITY","Walkup",88662.058099999995,155158.60149999999,122470.5419,214323.44839999999,155336.6893,271839.20630000002,202856.42749999999,354998.74810000003,252686.6624,442201.65919999999,284366.94819999998,497642.1593,315573.99410000001,552254.48979999998]
[7,"Region VII - Midwest",null,"IOWA","SIOUX CITY","Elevator",98549.528399999996,157679.24789999999,137969.33979999999,220750.94699999999,177389.15109999999,283822.64600000001,236518.8682,378430.1948,295648.58529999998,473037.74349999998,335068.39659999998,536109.44259999995,374488.20799999998,599181.14170000004]
[7,"Region VII - Midwest",null,"IOWA","WATERLOO","Detached/Semi-Detached",117637.1352,205864.98670000001,152842.1128,267473.6973,182773.2064,319853.11119999998,218125.51250000001,381719.64689999999,257485.14060000001,450598.99609999999,282520.8162,494411.42830000003,306131.7058,535730.48510000005]
[7,"Region VII - Midwest",null,"IOWA","WATERLOO","Row House",97938.830100000006,171392.95250000001,130550.72809999999,228463.77410000001,160913.41219999999,281598.47139999998,202580.53229999999,354515.93160000001,245115.09049999999,428951.40830000001,270695.21659999999,473716.62900000002,294664.18910000002,515662.33100000001]
[7,"Region VII - Midwest",null,"IOWA","WATERLOO","Walkup",89933.248999999996,157383.18580000001,124125.5386,217219.69260000001,157304.5632,275282.98550000001,205159.67749999999,359029.43560000003,255499.19690000001,447123.59450000001,287403.10149999999,502955.4276,318798.14600000001,557896.75549999997]
[7,"Region VII - Midwest",null,"IOWA","WATERLOO","Elevator",101408.5396,162253.66570000001,141971.9553,227155.13200000001,182535.37109999999,292056.5981,243380.49479999999,389408.79759999999,304225.61859999999,486760.99699999997,344789.0343,551662.46310000005,385352.45010000002,616563.92949999997]
[7,"Region VII - Midwest",null,"KANSAS","DODGE CITY","Detached/Semi-Detached",110195.05710000001,192841.3499,143221.20250000001,250637.10449999999,171310.3463,299793.10609999998,204503.99369999999,357881.989,241447.02720000001,422532.29749999999,264940.83159999998,463646.45539999998,287113.79609999998,502449.14319999999]
[7,"Region VII - Midwest",null,"KANSAS","DODGE CITY","Row House",91481.602400000003,160092.80420000001,122044.3873,213577.67790000001,150543.54199999999,263451.1986,189736.26269999999,332038.45970000001,229695.47959999999,401967.0894,253706.51209999999,443986.39620000002,276219.65549999999,483384.3971]
[7,"Region VII - Midwest",null,"KANSAS","DODGE CITY","Walkup",83835.758400000006,146712.5773,115678.1024,202436.67920000001,146557.84450000001,256476.22779999999,191059.70629999999,334354.48609999998,237921.75289999999,416363.06760000001,267590.1311,468282.72930000001,296775.09220000001,519356.41139999998]
[7,"Region VII - Midwest",null,"KANSAS","DODGE CITY","Elevator",94987.263300000006,151979.62359999999,132982.16870000001,212771.4731,170977.07399999999,273563.32250000001,227969.43210000001,364751.09669999999,284961.79009999998,455938.87089999998,322956.69540000003,516730.72029999999,360951.60070000001,577522.56980000006]
[7,"Region VII - Midwest",null,"KANSAS","FORT SCOTT","Detached/Semi-Detached",114395.6516,200192.3904,148548.75150000001,259960.31510000001,177567.80489999999,310743.65860000002,211814.26089999999,370674.95669999998,249965.09880000001,437438.9228,274239.90710000001,479919.83750000002,297105.81900000002,519935.18339999998]
[7,"Region VII - Midwest",null,"KANSAS","FORT SCOTT","Row House",95682.372000000003,167444.15100000001,127371.9362,222900.8885,156801.0007,274401.7512,197046.53,344831.42749999999,238213.55119999999,416873.71470000001,263005.58769999997,460259.77840000001,286211.67839999998,500870.43729999999]
[7,"Region VII - Midwest",null,"KANSAS","FORT SCOTT","Walkup",88145.679799999998,154254.93960000001,121711.99219999999,212995.98639999999,154315.70300000001,270052.48009999999,201403.51759999999,352456.1557,250851.51699999999,438990.15470000001,282243.86369999999,493926.76140000002,313152.79330000002,548017.38840000005]
[7,"Region VII - Midwest",null,"KANSAS","FORT SCOTT","Elevator",98624.163799999995,157798.66450000001,138073.82939999999,220918.13029999999,177523.49479999999,284037.59600000002,236697.9932,378716.79470000003,295872.4915,473395.99339999998,335322.15700000001,536515.45920000004,374771.82250000001,599634.92500000005]
[7,"Region VII - Midwest",null,"KANSAS","HAYS","Detached/Semi-Detached",104360.3898,182630.68220000001,135493.1563,237113.02359999999,161940.6286,283396.10009999998,193143.7469,338001.55709999998,227910.959,398844.17810000002,250035.20319999999,437561.60570000001,270867.20860000001,474017.6152]
[7,"Region VII - Midwest",null,"KANSAS","HAYS","Row House",87419.98,152984.9651,116322.56510000001,203564.489,143141.2052,250497.10920000001,179775.0638,314606.3615,217272.7156,380227.2524,239865.1874,419764.07809999998,261005.14420000001,456759.0024]
[7,"Region VII - Midwest",null,"KANSAS","HAYS","Walkup",80618.135599999994,141081.73740000001,111333.7213,194834.0122,141177.8989,247061.32310000001,184298.62210000001,322522.58850000001,229555.93350000001,401722.88370000001,258303.508,452031.13900000002,286613.46289999998,501573.56]
[7,"Region VII - Midwest",null,"KANSAS","HAYS","Elevator",89975.389800000004,143960.62580000001,125965.5457,201544.87609999999,161955.7015,259129.12640000001,215940.93539999999,345505.50189999997,269926.1692,431881.87729999999,305916.32520000002,489466.1275,341906.48109999998,547050.37789999996]
[7,"Region VII - Midwest",null,"KANSAS","KANSAS CITY","Detached/Semi-Detached",128824.3619,225442.63329999999,167322.27970000001,292813.98940000002,200041.0808,350071.89150000003,238666.7605,417666.8309,281685.88900000002,492950.30579999997,309054.6728,540845.67720000003,334847.4522,585983.04130000004]
[7,"Region VII - Midwest",null,"KANSAS","KANSAS CITY","Row House",107550.2654,188212.9644,143247.58319999999,250683.27069999999,176432.50219999999,308756.87880000001,221878.18119999999,388286.81719999999,268326.23440000002,469570.91019999998,296283.0246,518495.29310000001,322462.53370000003,564309.43400000001]
[7,"Region VII - Midwest",null,"KANSAS","KANSAS CITY","Walkup",98950.393200000006,173163.18799999999,136607.05960000001,239062.3542,173169.39970000001,303046.44939999998,225946.41339999999,395406.22350000002,281406.58470000001,492461.5233,316591.79519999999,554035.64159999997,351227.43680000002,614648.01450000005]
[7,"Region VII - Midwest",null,"KANSAS","KANSAS CITY","Elevator",111059.1158,177694.58799999999,155482.76209999999,248772.42319999999,199906.40849999999,319850.25829999999,266541.87800000003,426467.0111,333177.34749999997,533083.76399999997,377600.9938,604161.59900000005,422024.64010000002,675239.43429999996]
[7,"Region VII - Midwest",null,"KANSAS","LIBERAL","Detached/Semi-Detached",103160.2209,180530.3867,133971.00080000001,234449.25140000001,160152.78479999999,280267.37339999998,191055.10089999999,334346.4265,225477.22630000001,394585.1459,247378.32680000001,432912.07199999999,268012.34740000003,469021.60800000001]
[7,"Region VII - Midwest",null,"KANSAS","LIBERAL","Row House",86219.761199999994,150884.5821,114800.4097,200900.71679999999,141353.36139999999,247368.38260000001,177686.41769999999,310951.23109999998,214838.98300000001,375968.22019999998,237208.31099999999,415114.5442,258150.28289999999,451762.9952]
[7,"Region VII - Midwest",null,"KANSAS","LIBERAL","Walkup",79386.730500000005,138926.77849999999,109609.75410000001,191817.0698,138961.36979999999,243182.39720000001,181343.2499,317350.68729999999,225861.71840000001,395258.00719999999,254116.73079999999,444704.27899999998,281934.1237,493384.71639999998]
[7,"Region VII - Midwest",null,"KANSAS","LIBERAL","Elevator",88936.276199999993,142298.0441,124510.7867,199217.26180000001,160085.2972,256136.47930000001,213447.06289999999,341515.30579999997,266808.82860000001,426894.1323,302383.33919999999,483813.34980000003,337957.84960000002,540732.56759999995]
[7,"Region VII - Midwest",null,"KANSAS","SALINA","Detached/Semi-Detached",110243.2686,192925.72010000001,143318.796,250807.89309999999,171457.50339999999,300050.6311,204721.91949999999,358263.3591,241734.16740000001,423034.7929,265268.57329999999,464220.00319999998,287491.54060000001,503110.1961]
[7,"Region VII - Midwest",null,"KANSAS","SALINA","Row House",91332.784100000004,159832.37210000001,121919.0672,213358.36749999999,150472.10149999999,263326.1777,189798.7389,332147.79300000001,229858.91949999999,402253.1091,253915.99789999999,444352.9963,276482.72499999998,483844.76870000002]
[7,"Region VII - Midwest",null,"KANSAS","SALINA","Walkup",83577.569300000003,146260.7464,115298.8275,201772.94820000001,146047.35130000001,255582.86470000001,190333.25140000001,333083.1899,237004.1802,414757.31530000002,266528.58880000003,466425.03039999999,295564.49180000002,517237.86070000002]
[7,"Region VII - Midwest",null,"KANSAS","SALINA","Elevator",95024.581000000006,152039.33199999999,133034.4135,212855.06469999999,171044.24590000001,273670.79749999999,228058.9945,364894.39669999998,285073.74310000002,456117.99589999998,323083.57559999998,516933.72869999998,361093.408,577749.46140000003]
[7,"Region VII - Midwest",null,"KANSAS","TOPEKA","Detached/Semi-Detached",115788.67049999999,202630.17319999999,150461.28599999999,263307.25050000002,179944.28349999999,314902.49619999999,214774.6177,375855.5809,253547.4014,443707.9523,278207.7599,486863.57980000001,301471.66930000001,527575.42130000005]
[7,"Region VII - Midwest",null,"KANSAS","TOPEKA","Row House",96287.320099999997,168502.81020000001,128392.8149,224687.42610000001,158303.0871,277030.40230000002,199385.08720000001,348923.90259999997,241301.05170000001,422276.84029999998,266500.41619999998,466375.72830000002,290118.82770000002,507707.9485]
[7,"Region VII - Midwest",null,"KANSAS","TOPEKA","Walkup",88344.330499999996,154602.5785,121918.8628,213358.01,154490.26269999999,270357.95970000001,201453.07430000001,352542.88,250875.44690000001,439032.03200000001,282184.4779,493822.83630000002,312989.7377,547732.04079999996]
[7,"Region VII - Midwest",null,"KANSAS","TOPEKA","Elevator",99812.551500000001,159700.08480000001,139737.57209999999,223580.11869999999,179662.59270000001,287460.15259999997,239550.12359999999,383280.2035,299437.6545,479100.25439999998,339362.67509999999,542980.28830000001,379287.69579999999,606860.32220000005]
[7,"Region VII - Midwest",null,"KANSAS","WICHITA","Detached/Semi-Detached",111395.2259,194941.64540000001,144743.35810000001,253300.87659999999,173098.19010000001,302921.83270000003,206592.6397,361537.11949999997,243880.7598,426791.3296,267597.70809999999,468295.98910000001,289968.65740000003,507445.15049999999]
[7,"Region VII - Midwest",null,"KANSAS","WICHITA","Row House",92681.821200000006,162193.18719999999,123566.5428,216241.45009999999,152331.38579999999,266579.9253,191824.9088,335693.59029999998,232129.21230000001,406226.12150000001,256363.38860000001,448635.9301,279074.51679999998,488380.40429999999]
[7,"Region VII - Midwest",null,"KANSAS","WICHITA","Walkup",85067.163499999995,148867.5361,117402.06939999999,205453.62150000001,148774.37359999999,260355.1537,194015.0785,339526.3873,241615.9681,422827.94410000002,271776.90820000001,475609.5894,301454.4314,527545.25490000006]
[7,"Region VII - Midwest",null,"KANSAS","WICHITA","Elevator",96026.376900000003,153642.2053,134436.9276,215099.08739999999,172847.47829999999,276555.96950000001,230463.3046,368741.29269999999,288079.13069999998,460926.61589999998,326489.6814,522383.49800000002,364900.23210000002,583840.38009999995]
[7,"Region VII - Midwest",null,"MISSOURI","CAPE GIRARDEAU","Detached/Semi-Detached",111850.67939999999,195738.68900000001,145211.66010000001,254120.4051,173550.6459,303713.63020000001,206983.19149999999,362220.58510000003,244236.2127,427413.37219999998,267942.92940000002,468900.12650000001,290262.86290000001,507960.01]
[7,"Region VII - Midwest",null,"MISSOURI","CAPE GIRARDEAU","Row House",93728.389299999995,164024.6813,124703.5857,218231.27499999999,153439.6348,268519.36099999998,192681.80960000001,337193.1667,232855.76629999999,407497.59100000001,257063.37760000001,449860.91080000001,279712.74739999999,489497.30790000001]
[7,"Region VII - Midwest",null,"MISSOURI","CAPE GIRARDEAU","Walkup",86457.437000000005,151300.51490000001,119401.8826,208953.29459999999,151414.1244,264974.71759999997,197672.13819999999,345926.24190000002,246215.80480000001,430877.65830000001,277054.93609999999,484846.13819999999,307425.91629999998,537995.35329999996]
[7,"Region VII - Midwest",null,"MISSOURI","CAPE GIRARDEAU","Elevator",96433.983600000007,154294.37609999999,135007.57709999999,216012.12650000001,173581.17050000001,277729.87699999998,231441.5607,370306.50270000001,289301.9509,462883.12839999999,327875.54430000001,524600.87879999995,366449.13780000003,586318.62919999997]
[7,"Region VII - Midwest",null,"MISSOURI","COLUMBIA","Detached/Semi-Detached",120230.319,210403.0582,156276.7977,273484.39600000001,186937.5226,327140.66460000002,223174.50769999999,390555.3885,263501.16690000001,461127.04210000002,289145.5355,506004.68719999999,313352.40649999998,548366.71140000003]
[7,"Region VII - Midwest",null,"MISSOURI","COLUMBIA","Row House",99743.994300000006,174551.9901,133093.75839999999,232914.0773,164203.33749999999,287355.8406,207007.72899999999,362263.5257,250636.31529999999,438613.55170000001,276846.91230000003,484482.09669999999,301426.18969999999,527495.83200000005]
[7,"Region VII - Midwest",null,"MISSOURI","COLUMBIA","Walkup",91363.302599999995,159885.77970000001,126056.3734,220598.65340000001,159695.64850000001,279467.3848,208164.60190000001,364288.05320000002,259217.3364,453630.33860000002,291530.48670000001,510178.3518,323314.4227,565800.23979999998]
[7,"Region VII - Midwest",null,"MISSOURI","COLUMBIA","Elevator",103636.03750000001,165817.6624,145090.45240000001,232144.7273,186544.86730000001,298471.79220000003,248726.48980000001,397962.38959999999,310908.11229999998,497452.98700000002,352362.52720000001,563780.05189999996,393816.94219999999,630107.11690000002]
[7,"Region VII - Midwest",null,"MISSOURI","JEFFERSON CITY","Detached/Semi-Detached",120037.4765,210065.58379999999,155886.42850000001,272801.24969999999,186348.89929999999,326110.57380000001,222302.8107,389029.91879999998,262352.61320000002,459117.07309999998,287834.57709999999,503710.5098,311841.43680000002,545722.51439999999]
[7,"Region VII - Midwest",null,"MISSOURI","JEFFERSON CITY","Row House",100339.27129999999,175593.72469999999,133595.04370000001,233791.32639999999,164489.10509999999,287855.9339,206757.83059999999,361826.2035,249982.5631,437469.48540000001,276008.97749999998,483015.71049999999,300373.92019999999,525654.36029999994]
[7,"Region VII - Midwest",null,"MISSOURI","JEFFERSON CITY","Walkup",92396.062699999995,161693.10990000001,127573.47779999999,223253.5863,161737.62789999999,283040.84889999998,211070.43049999999,369373.25349999999,262887.63819999999,460053.36680000002,295776.66820000001,517609.16950000002,328156.8383,574274.46710000001]
[7,"Region VII - Midwest",null,"MISSOURI","JEFFERSON CITY","Elevator",103486.7697,165578.834,144881.47760000001,231810.3676,186276.18539999999,298041.90110000002,248368.24720000001,397389.20150000002,310460.30900000001,496736.50199999998,351855.01689999999,562968.03540000005,393249.72480000003,629199.56909999996]
[7,"Region VII - Midwest",null,"MISSOURI","JOPLIN","Detached/Semi-Detached",111802.4679,195654.31890000001,145114.06649999999,253949.6165,173403.48869999999,303456.10519999999,206765.26569999999,361839.21500000003,243949.0724,426910.87670000002,267615.18780000001,468326.57870000001,289885.11829999997,507298.9571]
[7,"Region VII - Midwest",null,"MISSOURI","JOPLIN","Row House",93877.207699999999,164285.11350000001,124828.90579999999,218450.58530000001,153511.0754,268644.38189999998,192619.3334,337083.8334,232692.3265,407211.57130000001,256853.89189999999,449494.31079999998,279449.67790000001,489036.9363]
[7,"Region VII - Midwest",null,"MISSOURI","JOPLIN","Walkup",86715.626099999994,151752.34580000001,119781.1575,209617.02559999999,151924.6176,265868.0808,198398.59330000001,347197.53810000001,247133.3775,432483.4106,278116.47830000002,486703.8371,308636.51659999997,540113.90410000004]
[7,"Region VII - Midwest",null,"MISSOURI","JOPLIN","Elevator",96396.665900000007,154234.6678,134955.33230000001,215928.535,173513.99859999999,277622.402,231351.99830000001,370163.20260000002,289189.99780000001,462704.00339999999,327748.6642,524397.87049999996,366307.33049999998,586091.73759999999]
[7,"Region VII - Midwest",null,"MISSOURI","KANSAS CITY","Detached/Semi-Detached",128127.84669999999,224223.7317,166366.0048,291140.50839999999,198852.83230000001,347992.45640000002,237186.57079999999,415076.49890000001,279894.7243,489815.76750000002,307070.7316,537373.78020000004,332664.51089999999,582162.89410000003]
[7,"Region VII - Midwest",null,"MISSOURI","KANSAS CITY","Row House",107247.7873,187683.62779999999,142737.13819999999,249789.99189999999,175681.45170000001,307442.5404,220708.8927,386240.56229999999,266782.4718,466869.32579999999,294535.59659999999,515437.2941,320508.94390000001,560890.65190000006]
[7,"Region VII - Midwest",null,"MISSOURI","KANSAS CITY","Walkup",98851.064499999993,172989.36309999999,136503.61989999999,238881.33489999999,173082.11439999999,302893.70020000002,225921.62839999999,395362.84960000002,281394.6115,492440.57010000001,316621.47879999998,554087.58790000004,351308.9546,614790.67059999995]
[7,"Region VII - Midwest",null,"MISSOURI","KANSAS CITY","Elevator",110464.91710000001,176743.86989999999,154650.88380000001,247441.4178,198836.85060000001,318138.9657,265115.80080000003,424185.28769999999,331394.75109999999,530231.60959999997,375580.71789999999,600929.15749999997,419766.68469999998,671626.70550000004]
[7,"Region VII - Midwest",null,"MISSOURI","ROLLA","Detached/Semi-Detached",112906.21339999999,197585.87349999999,146441.03460000001,256271.81049999999,174897.01730000001,306069.78029999998,208418.0588,364731.6029,245808.52290000001,430164.91509999998,269616.57919999998,471829.0135,291984.48820000002,510972.85440000001]
[7,"Region VII - Midwest",null,"MISSOURI","ROLLA","Row House",95375.064100000003,166906.3622,126601.7026,221552.97940000001,155441.80069999999,272023.15130000003,194583.02669999999,340520.29670000001,234799.17850000001,410898.56229999999,259091.79560000001,453410.64230000001,281778.39860000001,493112.19750000001]
[7,"Region VII - Midwest",null,"MISSOURI","ROLLA","Walkup",88463.410999999993,154810.96919999999,122263.6764,213961.4339,155162.1361,271533.73820000002,202806.87959999999,354912.0393,252662.74350000001,442159.80119999999,284426.34639999998,497746.10619999998,315737.0638,552539.86179999996]
[7,"Region VII - Midwest",null,"MISSOURI","ROLLA","Elevator",97361.143800000005,155777.83249999999,136305.60140000001,218088.96539999999,175250.0589,280400.09840000002,233666.7452,373866.79790000001,292083.43150000001,467333.49739999999,331027.88900000002,529644.63029999996,369972.34659999999,591955.76340000005]
[7,"Region VII - Midwest",null,"MISSOURI","SPRINGFIELD","Detached/Semi-Detached",118285.43120000001,206999.50459999999,153700.78400000001,268976.37209999998,183814.28539999999,321674.99959999998,219387.76130000001,383928.58230000001,258989.14720000001,453231.00750000001,284176.99609999999,497309.74300000002,307936.88089999999,538889.54169999994]
[7,"Region VII - Midwest",null,"MISSOURI","SPRINGFIELD","Row House",98390.121100000004,172182.71189999999,131186.48560000001,229576.3499,161735.89350000001,283037.8137,203687.3315,356452.83010000002,246495.39670000001,431366.94410000002,272233.14059999998,476407.99589999998,296354.68920000002,518620.70620000002]
[7,"Region VII - Midwest",null,"MISSOURI","SPRINGFIELD","Walkup",90290.762400000007,158008.83420000001,124608.2473,218064.43280000001,157902.3345,276329.08539999998,205910.9086,360344.09,256428.73180000001,448750.2806,288434.94770000002,504761.15860000002,319927.21519999998,559872.62659999996]
[7,"Region VII - Midwest",null,"MISSOURI","SPRINGFIELD","Elevator",101965.414,163144.6649,142751.57949999999,228402.53080000001,183537.7452,293660.39669999998,244716.99359999999,391547.19559999998,305896.24200000003,489433.99440000003,346682.40759999998,554691.86029999994,387468.57319999998,619949.72629999998]
[7,"Region VII - Midwest",null,"MISSOURI","ST. JOSEPH","Detached/Semi-Detached",124430.9135,217754.0986,161604.34659999999,282807.6066,193194.98130000001,338091.21710000001,230484.77489999999,403348.35619999998,272019.23849999998,476033.66739999998,298444.61109999998,522278.06939999998,323344.42940000002,565852.75159999996]
[7,"Region VII - Midwest",null,"MISSOURI","ST. JOSEPH","Row House",103944.76390000001,181903.33679999999,138421.30739999999,242237.2879,170460.79610000001,298306.39319999999,214317.99619999999,375056.49339999998,259154.38690000001,453520.17700000003,286145.98790000001,500755.47889999999,311418.21260000003,544981.87210000004]
[7,"Region VII - Midwest",null,"MISSOURI","ST. JOSEPH","Walkup",95673.224000000002,167428.14199999999,132090.26329999999,231157.9607,167453.50690000001,293043.63709999999,218508.41320000001,382389.723,272147.1005,476257.42570000002,306184.2194,535822.38379999995,339692.1238,594461.21680000005]
[7,"Region VII - Midwest",null,"MISSOURI","ST. JOSEPH","Elevator",107272.9379,171636.70319999999,150182.11309999999,240291.38449999999,193091.28820000001,308946.06569999998,257455.05100000001,411928.08769999997,321818.8137,514910.10950000002,364727.98879999999,583564.79079999996,407637.16399999999,652219.47210000001]
[7,"Region VII - Midwest",null,"MISSOURI","ST. LOUIS","Detached/Semi-Detached",129376.23480000001,226408.41080000001,167985.764,293975.087,200787.8456,351378.72979999997,239493.15770000001,419113.02590000001,282615.6152,494577.32640000002,310055.36930000002,542596.89639999997,335897.13819999999,587819.99190000002]
[7,"Region VII - Midwest",null,"MISSOURI","ST. LOUIS","Row House",108299.19319999999,189523.58809999999,144133.98120000001,252234.46710000001,177397.86470000001,310446.26319999999,222860.0281,390005.0491,269379.66080000001,471414.40649999998,297401.97710000002,520453.46,323626.89480000001,566347.06590000005]
[7,"Region VII - Midwest",null,"MISSOURI","ST. LOUIS","Walkup",99824.284799999994,174692.49840000001,137848.31789999999,241234.5564,174788.1574,305879.27549999999,228150.55439999999,399263.47029999999,284171.26500000001,497299.71380000003,319746.72600000002,559556.77060000005,354777.70689999999,620860.98699999996]
[7,"Region VII - Midwest",null,"MISSOURI","ST. LOUIS","Elevator",111541.35490000001,178466.17050000001,156157.89679999999,249852.63870000001,200774.4388,321239.10680000001,267699.25170000002,428318.80910000001,334624.06469999999,535398.51139999996,379240.6066,606784.97959999996,423857.14860000001,678171.44779999997]
[7,"Region VII - Midwest",null,"NEBRASKA","GRAND ISLAND","Detached/Semi-Detached",114395.6516,200192.3904,148548.75150000001,259960.31510000001,177567.80489999999,310743.65860000002,211814.26089999999,370674.95669999998,249965.09880000001,437438.9228,274239.90710000001,479919.83750000002,297105.81900000002,519935.18339999998]
[7,"Region VII - Midwest",null,"NEBRASKA","GRAND ISLAND","Row House",95682.372000000003,167444.15100000001,127371.9362,222900.8885,156801.0007,274401.7512,197046.53,344831.42749999999,238213.55119999999,416873.71470000001,263005.58769999997,460259.77840000001,286211.67839999998,500870.43729999999]
[7,"Region VII - Midwest",null,"NEBRASKA","GRAND ISLAND","Walkup",88145.679799999998,154254.93960000001,121711.99219999999,212995.98639999999,154315.70300000001,270052.48009999999,201403.51759999999,352456.1557,250851.51699999999,438990.15470000001,282243.86369999999,493926.76140000002,313152.79330000002,548017.38840000005]
[7,"Region VII - Midwest",null,"NEBRASKA","GRAND ISLAND","Elevator",98624.163799999995,157798.66450000001,138073.82939999999,220918.13029999999,177523.49479999999,284037.59600000002,236697.9932,378716.79470000003,295872.4915,473395.99339999998,335322.15700000001,536515.45920000004,374771.82250000001,599634.92500000005]
[7,"Region VII - Midwest",null,"NEBRASKA","LINCOLN","Detached/Semi-Detached",112450.76390000001,196788.83670000001,145972.7378,255452.29120000001,174444.56770000001,305277.99359999999,208027.51449999999,364048.15039999998,245453.079,429542.88829999999,269271.3676,471224.8934,291690.29350000003,510458.01360000001]
[7,"Region VII - Midwest",null,"NEBRASKA","LINCOLN","Row House",94328.498699999996,165074.87280000001,125464.6634,219563.1611,154333.55669999999,270083.7243,193726.13260000001,339020.73190000001,234072.63269999999,409627.10710000002,258391.81589999999,452185.6777,281140.17800000001,491995.31160000002]
[7,"Region VII - Midwest",null,"NEBRASKA","LINCOLN","Walkup",87073.139599999995,152377.99419999999,120263.8662,210461.76579999999,152522.38889999999,266914.18050000002,199149.82430000001,348512.1925,248062.9124,434110.09669999999,279148.3247,488509.56819999998,309765.5858,542089.77520000003]
[7,"Region VII - Midwest",null,"NEBRASKA","LINCOLN","Elevator",96953.540399999998,155125.66699999999,135734.9566,217175.93369999999,174516.37270000001,279226.20059999998,232688.497,372301.60070000001,290860.62119999999,465377.00089999998,329642.03739999997,527427.26769999997,368423.4535,589477.53449999995]
[7,"Region VII - Midwest",null,"NEBRASKA","NORFOLK","Detached/Semi-Detached",115188.586,201580.02549999999,149700.20819999999,261975.36439999999,179050.36170000001,313338.13290000003,213730.2947,374028.01569999999,252330.535,441578.4363,276879.32160000002,484538.81290000002,300044.23869999999,525077.41760000004]
[7,"Region VII - Midwest",null,"NEBRASKA","NORFOLK","Row House",95687.210600000006,167452.61869999999,127631.7372,223355.54,157409.16510000001,275466.03909999999,198340.76420000001,347096.33730000001,240084.18530000001,420147.32429999998,265171.9779,464050.96139999997,288691.3971,505209.9449]
[7,"Region VII - Midwest",null,"NEBRASKA","NORFOLK","Walkup",87728.627999999997,153525.09899999999,121056.8793,211849.53880000001,153381.9982,268418.49680000002,199975.38819999999,349956.92940000002,249028.33919999999,435799.59379999997,280091.08929999999,490159.40639999998,310650.06809999997,543637.61899999995]
[7,"Region VII - Midwest",null,"NEBRASKA","NORFOLK","Elevator",99292.994699999996,158868.79389999999,139010.19270000001,222416.31159999999,178727.39050000001,285963.82909999997,238303.18729999999,381285.1054,297878.98420000001,476606.38189999998,337596.18209999998,540153.89939999999,377313.38,603701.41700000002]
[7,"Region VII - Midwest",null,"NEBRASKA","NORTH PLATTE","Detached/Semi-Detached",113243.6943,198176.465,147124.1894,257467.3315,175927.1182,307872.45699999999,209943.54070000001,367401.19620000001,247818.50630000001,433682.386,271910.77230000001,475843.85149999999,294628.7023,515600.2291]
[7,"Region VII - Midwest",null,"NEBRASKA","NORTH PLATTE","Row House",94333.334700000007,165083.33590000001,125724.46060000001,220017.80600000001,154941.7163,271148.0036,195020.36009999999,341285.63020000001,235943.25839999999,412900.7023,260558.19690000001,455976.84460000001,283619.88669999997,496334.80160000001]
[7,"Region VII - Midwest",null,"NEBRASKA","NORTH PLATTE","Walkup",86656.085600000006,151648.14989999999,119608.7504,209315.3131,151588.68059999999,265280.1911,197721.6905,346012.9583,246239.7291,430919.52590000001,276995.5442,484742.20240000001,307262.85379999998,537709.99399999995]
[7,"Region VII - Midwest",null,"NEBRASKA","NORTH PLATTE","Elevator",97622.368000000002,156195.79120000001,136671.31520000001,218674.10759999999,175720.26240000001,281152.424,234293.68309999999,374869.89870000002,292867.10399999999,468587.37339999998,331916.05119999999,531065.68980000005,370964.99839999998,593544.00619999995]
[7,"Region VII - Midwest",null,"NEBRASKA","OMAHA","Detached/Semi-Detached",114947.5246,201158.16800000001,149212.23579999999,261121.41269999999,178314.56959999999,312050.49690000003,212640.65820000001,372121.15169999999,250894.82490000001,439065.94349999999,275240.60379999998,481671.05660000001,298155.50510000001,521772.13400000002]
[7,"Region VII - Midwest",null,"NEBRASKA","OMAHA","Row House",96431.299799999993,168754.7746,128258.3342,224452.08489999999,157766.36309999999,276091.13549999997,198028.3769,346549.6594,239266.97769999999,418717.21100000001,264124.54019999999,462217.94530000002,287376.03960000002,502908.06929999997]
[7,"Region VII - Midwest",null,"NEBRASKA","OMAHA","Walkup",89019.571500000005,155784.2501,122953.2506,215168.18859999999,155934.46059999999,272885.30619999999,203607.6586,356313.40259999997,253616.1972,443828.34519999998,285398.79450000002,499447.89039999997,316703.06339999998,554230.36089999997]
[7,"Region VII - Midwest",null,"NEBRASKA","OMAHA","Elevator",99106.402799999996,158570.247,138748.96400000001,221998.34580000001,178391.5252,285426.44459999999,237855.36689999999,380568.59279999998,297319.20860000001,475710.74099999998,336961.76980000001,539138.83979999996,376604.3309,602566.93850000005]
[8,"Region VIII -",null,"COLORADO","BOULDER","Detached/Semi-Detached",118740.8846,207796.54810000001,154169.08600000001,269795.90039999998,184266.74119999999,322466.79710000003,219778.3131,384612.04790000001,259344.60010000001,453853.05009999999,284522.21740000002,497913.88030000002,308231.08639999997,539404.40119999996]
[8,"Region VIII -",null,"COLORADO","BOULDER","Row House",99436.689199999993,174014.20600000001,132323.52849999999,231566.17490000001,162844.14249999999,284977.24930000002,204544.2323,357952.40649999998,247221.95069999999,432638.41369999998,272933.12959999999,477632.97659999999,296992.91989999998,519737.60989999998]
[8,"Region VIII -",null,"COLORADO","BOULDER","Walkup",91681.035900000003,160441.81289999999,126608.06050000001,221564.1059,160542.08530000001,280948.64929999999,209567.96840000001,366743.94469999999,261028.56839999999,456799.99479999999,293712.97560000001,513997.70730000001,325898.69990000001,570322.72490000003]
[8,"Region VIII -",null,"COLORADO","BOULDER","Elevator",102373.02069999999,163796.83559999999,143322.22899999999,229315.5699,184271.43729999999,294834.30410000001,245695.24969999999,393112.40549999999,307119.06219999999,491390.50689999998,348068.27049999998,556909.24109999998,389017.47879999998,622427.9754]
[8,"Region VIII -",null,"COLORADO","COLORADO SPRINGS","Detached/Semi-Detached",115140.37450000001,201495.65530000001,149602.61480000001,261804.57579999999,178903.20449999999,313080.6078,213512.3689,373646.64559999999,252043.39480000001,441075.94079999998,276551.58010000002,483965.26510000002,299666.49410000001,524416.36470000003]
[8,"Region VIII -",null,"COLORADO","COLORADO SPRINGS","Row House",95836.028999999995,167713.0508,127757.0573,223574.85029999999,157480.60569999999,275591.06,198278.28810000001,346987.00400000002,239920.74540000001,419861.30440000002,264962.49229999998,463684.36139999999,288428.32760000002,504749.57329999999]
[8,"Region VIII -",null,"COLORADO","COLORADO SPRINGS","Walkup",87986.8171,153976.92989999999,121436.1542,212513.26980000001,153892.4914,269311.86,200701.8432,351228.22560000001,249945.91200000001,437405.34590000001,281152.63160000002,492017.1053,311860.66840000002,545756.16980000003]
[8,"Region VIII -",null,"COLORADO","COLORADO SPRINGS","Elevator",99255.676999999996,158809.08559999999,138957.94779999999,222332.7199,178660.21859999999,285856.3541,238213.62479999999,381141.80550000002,297767.03110000002,476427.25689999998,337469.30190000002,539950.89110000001,377171.57270000002,603474.52540000004]
[8,"Region VIII -",null,"COLORADO","DENVER","Detached/Semi-Detached",120685.7724,211200.1018,156745.09959999999,274303.92440000002,187389.97829999999,327932.4621,223565.0595,391238.8542,263856.61979999999,461749.0846,289490.75689999998,506608.82449999999,313646.61190000002,548881.57090000005]
[8,"Region VIII -",null,"COLORADO","DENVER","Row House",100790.56230000001,176383.48420000001,134230.80129999999,234903.90229999999,165311.5864,289295.27620000002,207864.62969999999,363763.10200000001,251362.86929999999,439885.02120000002,277546.90139999997,485707.0773,302064.4203,528612.73549999995]
[8,"Region VIII -",null,"COLORADO","DENVER","Walkup",92753.576100000006,162318.75829999999,128056.1865,224098.3265,162335.39920000001,284086.94870000001,211821.66159999999,370687.90789999999,263817.17300000001,461680.05290000001,296808.51459999999,519414.90059999999,329285.90749999997,576250.3382]
[8,"Region VIII -",null,"COLORADO","DENVER","Elevator",104043.6441,166469.83309999999,145661.1018,233057.76639999999,187278.5595,299645.6997,249704.74600000001,399527.59950000001,312130.9325,499409.49949999998,353748.39010000002,565997.43259999994,395365.84779999999,632585.36600000004]
[8,"Region VIII -",null,"COLORADO","DURANGO","Detached/Semi-Detached",114851.1051,200989.43400000001,149017.05350000001,260779.84349999999,178020.26070000001,311535.45610000001,212204.81280000001,371358.42229999998,250320.55160000001,438060.96529999998,274585.12849999999,480523.97480000003,297400.0245,520450.0429]
[8,"Region VIII -",null,"COLORADO","DURANGO","Row House",96728.94,169275.64499999999,128508.9791,224890.71350000001,157909.24960000001,276341.18680000002,197903.4307,346331.00380000001,238940.1053,418145.18420000002,263705.57669999998,461484.75910000002,286849.90909999999,501987.34090000001]
[8,"Region VIII -",null,"COLORADO","DURANGO","Walkup",89535.953299999994,156687.91829999999,123711.8054,216495.65960000001,156955.45370000001,274672.04399999999,205060.57740000001,358856.01030000002,255451.35370000001,447039.8689,287521.89150000003,503163.3101,319124.2782,558467.48679999996]
[8,"Region VIII -",null,"COLORADO","DURANGO","Elevator",99031.770600000003,158450.83530000001,138644.47880000001,221831.16940000001,178257.18700000001,285211.50349999999,237676.2493,380282.00469999999,297095.31170000002,475352.50589999999,336708.01990000001,538732.84,376320.72810000001,602113.17409999995]
[8,"Region VIII -",null,"COLORADO","FORT COLLINS","Detached/Semi-Detached",119485.6,209099.8,155222.93960000001,271640.14429999999,185602.1292,324803.72619999998,221476.40729999999,387583.71279999998,261422.8799,457490.03970000002,286833.8725,501959.27679999999,310791.74219999998,543885.54890000005]
[8,"Region VIII -",null,"COLORADO","FORT COLLINS","Row House",99590.339900000006,174283.0949,132708.64120000001,232240.12210000001,163523.73730000001,286166.54029999999,205775.97750000001,360107.9607,248929.12940000001,435625.97639999999,274890.01699999999,481057.52970000001,299209.55050000001,523616.71340000001]
[8,"Region VIII -",null,"COLORADO","FORT COLLINS","Walkup",91522.167400000006,160163.79310000001,126332.21430000001,221081.37520000001,160118.86360000001,280208.01120000001,208866.2807,365515.99129999999,260122.94690000001,455215.15710000001,292621.72489999997,512088.01860000001,324606.55430000002,568061.47019999998]
[8,"Region VIII -",null,"COLORADO","FORT COLLINS","Elevator",103004.5275,164807.24650000001,144206.33850000001,230730.14509999999,185408.1495,296653.04369999998,247210.86610000001,395537.39159999997,309013.58260000002,494421.73950000003,350215.39360000001,560344.63809999998,391417.2046,626267.53670000006]
[8,"Region VIII -",null,"COLORADO","GRAND JUNCTION","Detached/Semi-Detached",122534.2372,214434.91510000001,159125.9264,278470.3713,190218.90119999999,332883.07709999999,226915.95439999999,397102.92009999999,267794.3591,468640.12829999998,293803.81319999998,514156.67300000001,318306.64840000001,557036.6348]
[8,"Region VIII -",null,"COLORADO","GRAND JUNCTION","Row House",102442.0723,179273.62650000001,136388.7144,238680.25030000001,167921.91149999999,293863.34519999998,211060.07490000001,369355.1311,255176.90820000001,446559.58929999999,281741.70179999998,493047.97810000001,306609.7818,536567.11809999996]
[8,"Region VIII -",null,"COLORADO","GRAND JUNCTION","Walkup",94342.494600000005,165099.36559999999,130262.86229999999,227960.0091,165149.6997,289011.97450000001,215528.26490000001,377174.46350000001,268440.92310000001,469771.61540000001,302027.13809999998,528547.49170000001,335094.31589999999,586415.05279999995]
[8,"Region VIII -",null,"COLORADO","GRAND JUNCTION","Elevator",105639.63219999999,169023.41399999999,147895.48499999999,236632.77960000001,190151.33790000001,304242.14520000003,253535.11720000001,405656.1936,316918.89659999998,507070.24200000003,359174.74939999997,574679.60759999999,401430.60220000002,642288.97309999994]
[8,"Region VIII -",null,"COLORADO","GREELEY","Detached/Semi-Detached",118285.43120000001,206999.50459999999,153700.78400000001,268976.37209999998,183814.28539999999,321674.99959999998,219387.76130000001,383928.58230000001,258989.14720000001,453231.00750000001,284176.99609999999,497309.74300000002,307936.88089999999,538889.54169999994]
[8,"Region VIII -",null,"COLORADO","GREELEY","Row House",98390.121100000004,172182.71189999999,131186.48560000001,229576.3499,161735.89350000001,283037.8137,203687.3315,356452.83010000002,246495.39670000001,431366.94410000002,272233.14059999998,476407.99589999998,296354.68920000002,518620.70620000002]
[8,"Region VIII -",null,"COLORADO","GREELEY","Walkup",90290.762400000007,158008.83420000001,124608.2473,218064.43280000001,157902.3345,276329.08539999998,205910.9086,360344.09,256428.73180000001,448750.2806,288434.94770000002,504761.15860000002,319927.21519999998,559872.62659999996]
[8,"Region VIII -",null,"COLORADO","GREELEY","Elevator",101965.414,163144.6649,142751.57949999999,228402.53080000001,183537.7452,293660.39669999998,244716.99359999999,391547.19559999998,305896.24200000003,489433.99440000003,346682.40759999998,554691.86029999994,387468.57319999998,619949.72629999998]
[8,"Region VIII -",null,"COLORADO","MONTROSE","Detached/Semi-Detached",110002.21460000001,192503.8756,142830.83319999999,249953.95809999999,170721.723,298763.01520000002,203632.29670000001,356356.51919999998,240298.47339999999,420522.3284,263629.87310000003,461352.27799999999,285602.82640000002,499804.94620000001]
[8,"Region VIII -",null,"COLORADO","MONTROSE","Row House",92076.879400000005,161134.53890000001,122545.67260000001,214454.927,150829.30970000001,263951.29190000001,189486.36429999999,331601.13760000002,229041.72750000001,400823.02309999999,252868.5772,442520.01,275167.386,481542.92550000001]
[8,"Region VIII -",null,"COLORADO","MONTROSE","Walkup",84868.518500000006,148519.90760000001,117195.2069,205091.61199999999,148599.82389999999,260049.69190000001,193965.53510000001,339439.6863,241592.05480000001,422786.09580000001,271836.3125,475713.54700000002,301617.50780000002,527830.63870000001]
[8,"Region VIII -",null,"COLORADO","MONTROSE","Elevator",94837.995599999995,151740.7953,132773.19390000001,212437.1134,170708.3921,273133.4314,227611.18950000001,364177.90860000002,284513.98690000002,455222.38579999999,322449.1851,515918.70380000002,360384.38339999999,576615.022]
[8,"Region VIII -",null,"COLORADO","PUEBLO","Detached/Semi-Detached",114995.73609999999,201242.53820000001,149309.82930000001,261292.20120000001,178461.7268,312308.02189999999,212858.584,372502.52189999999,251181.9651,439568.4388,275568.34539999999,482244.60440000001,298533.24969999999,522433.18699999998]
[8,"Region VIII -",null,"COLORADO","PUEBLO","Row House",96282.481400000004,168494.34239999999,128133.014,224232.7746,157694.92249999999,275966.11450000003,198090.853,346658.9927,239430.41759999999,419003.23080000002,264334.02590000001,462584.5453,287639.1091,503368.44089999999]
[8,"Region VIII -",null,"COLORADO","PUEBLO","Walkup",88761.382299999997,155332.4191,122573.9757,214504.45759999999,155423.9675,271991.94309999997,202881.20370000001,355042.10639999999,252698.62460000001,442222.59299999999,284337.25229999999,497590.19140000001,315492.46299999999,552111.81019999995]
[8,"Region VIII -",null,"COLORADO","PUEBLO","Elevator",99143.720600000001,158629.95540000001,138801.20879999999,222081.9374,178458.69699999999,285533.91950000002,237944.92939999999,380711.89270000003,297431.1618,475889.86599999998,337088.65,539341.84809999994,376746.13829999999,602793.83019999997]
[8,"Region VIII -",null,"MONTANA","BILLINGS","Detached/Semi-Detached",118092.58869999999,206662.03020000001,153310.41469999999,268293.22570000001,183225.66209999999,320644.90879999998,218516.0643,382403.11259999999,257840.59340000001,451221.03850000002,282866.03759999998,495015.56569999998,306425.91129999998,536245.34459999995]
[8,"Region VIII -",null,"MONTANA","BILLINGS","Row House",98985.398100000006,173224.4466,131687.7709,230453.59899999999,162021.6611,283537.90700000001,203437.43309999999,356015.50790000003,245841.64449999999,430222.87780000002,271395.20559999999,474941.60969999997,295302.41979999997,516779.23460000003]
[8,"Region VIII -",null,"MONTANA","BILLINGS","Walkup",91323.522500000006,159816.16450000001,126125.3518,220719.36559999999,159944.31390000001,279902.54940000002,208816.73730000001,365429.29029999999,260099.0336,455173.3088,292681.12920000002,512191.97629999998,324769.63079999998,568346.85389999999]
[8,"Region VIII -",null,"MONTANA","BILLINGS","Elevator",101816.14629999999,162905.8365,142542.6047,228068.17110000001,183269.06330000001,293230.50559999997,244358.75099999999,390974.00750000001,305448.4388,488717.50939999998,346174.89730000001,553879.84389999998,386901.35580000002,619042.17850000004]
[8,"Region VIII -",null,"MONTANA","BUTTE","Detached/Semi-Detached",114540.29,200445.50760000001,148841.53700000001,260472.68969999999,178009.28260000001,311516.24459999998,212468.0459,371819.08020000003,250826.52849999999,438946.42479999998,275223.14189999999,481640.49819999997,298239.06349999999,521918.36109999998]
[8,"Region VIII -",null,"MONTANA","BUTTE","Row House",95235.919599999994,166662.85930000001,126995.97960000001,222242.96419999999,156586.6839,274026.69679999998,197233.965,345159.4387,238703.87909999999,417731.78840000002,263634.054,461359.5944,287000.897,502251.56969999999]
[8,"Region VIII -",null,"MONTANA","BUTTE","Walkup",87371.114499999996,152899.45060000001,120574.1707,211004.79860000001,152784.22690000001,267372.397,199224.15719999999,348642.27500000002,248098.80439999999,434172.90769999998,279059.24300000002,488353.6753,309520.9988,541661.74789999996]
[8,"Region VIII -",null,"MONTANA","BUTTE","Elevator",98736.120299999995,157977.7948,138230.56830000001,221168.91269999999,177725.01639999999,284360.0306,236966.68859999999,379146.70740000001,296208.36080000002,473933.38439999998,335702.8089,537124.50219999999,375197.25699999998,600315.62009999994]
[8,"Region VIII -",null,"MONTANA","GREAT FALLS","Detached/Semi-Detached",118092.58869999999,206662.03020000001,153310.41469999999,268293.22570000001,183225.66209999999,320644.90879999998,218516.0643,382403.11259999999,257840.59340000001,451221.03850000002,282866.03759999998,495015.56569999998,306425.91129999998,536245.34459999995]
[8,"Region VIII -",null,"MONTANA","GREAT FALLS","Row House",98985.398100000006,173224.4466,131687.7709,230453.59899999999,162021.6611,283537.90700000001,203437.43309999999,356015.50790000003,245841.64449999999,430222.87780000002,271395.20559999999,474941.60969999997,295302.41979999997,516779.23460000003]
[8,"Region VIII -",null,"MONTANA","GREAT FALLS","Walkup",91323.522500000006,159816.16450000001,126125.3518,220719.36559999999,159944.31390000001,279902.54940000002,208816.73730000001,365429.29029999999,260099.0336,455173.3088,292681.12920000002,512191.97629999998,324769.63079999998,568346.85389999999]
[8,"Region VIII -",null,"MONTANA","GREAT FALLS","Elevator",101816.14629999999,162905.8365,142542.6047,228068.17110000001,183269.06330000001,293230.50559999997,244358.75099999999,390974.00750000001,305448.4388,488717.50939999998,346174.89730000001,553879.84389999998,386901.35580000002,619042.17850000004]
[8,"Region VIII -",null,"MONTANA","HELENA","Detached/Semi-Detached",116892.41620000001,204561.72839999999,151788.25459999999,265629.44559999998,181437.81299999999,317516.1728,216427.41209999999,378747.97110000002,255406.8535,446961.99369999999,280209.1532,490366.01799999998,303571.04149999999,531249.32259999996]
[8,"Region VIII -",null,"MONTANA","HELENA","Row House",97785.175700000007,171124.05729999999,130165.61079999999,227789.81890000001,160233.81200000001,280409.17109999998,201348.78090000001,352360.3665,243407.90460000001,425963.83299999998,268738.32120000001,470292.06209999998,292447.55009999999,511783.21250000002]
[8,"Region VIII -",null,"MONTANA","HELENA","Walkup",90092.113800000006,157661.1992,124401.3796,217702.4143,157727.7782,276023.61190000002,205861.35630000001,360257.3737,256404.80739999999,448708.413,288494.33960000001,504865.0944,320090.27769999998,560157.98589999997]
[8,"Region VIII -",null,"MONTANA","HELENA","Elevator",100777.02959999999,161243.24979999999,141087.84150000001,225740.54980000001,181398.65330000001,290237.84960000002,241864.87109999999,386983.79950000002,302331.08889999997,483729.74949999998,342641.9007,548227.04929999996,382952.71260000003,612724.3493]
[8,"Region VIII -",null,"MONTANA","MISSOULA","Detached/Semi-Detached",115788.67049999999,202630.17319999999,150461.28599999999,263307.25050000002,179944.28349999999,314902.49619999999,214774.6177,375855.5809,253547.4014,443707.9523,278207.7599,486863.57980000001,301471.66930000001,527575.42130000005]
[8,"Region VIII -",null,"MONTANA","MISSOULA","Row House",96287.320099999997,168502.81020000001,128392.8149,224687.42610000001,158303.0871,277030.40230000002,199385.08720000001,348923.90259999997,241301.05170000001,422276.84029999998,266500.41619999998,466375.72830000002,290118.82770000002,507707.9485]
[8,"Region VIII -",null,"MONTANA","MISSOULA","Walkup",88344.330499999996,154602.5785,121918.8628,213358.01,154490.26269999999,270357.95970000001,201453.07430000001,352542.88,250875.44690000001,439032.03200000001,282184.4779,493822.83630000002,312989.7377,547732.04079999996]
[8,"Region VIII -",null,"MONTANA","MISSOULA","Elevator",99812.551500000001,159700.08480000001,139737.57209999999,223580.11869999999,179662.59270000001,287460.15259999997,239550.12359999999,383280.2035,299437.6545,479100.25439999998,339362.67509999999,542980.28830000001,379287.69579999999,606860.32220000005]
[8,"Region VIII -",null,"NORTH DAKOTA","BISMARCK","Detached/Semi-Detached",121285.85679999999,212250.24950000001,157506.17739999999,275635.81050000002,188283.90030000001,329496.82549999998,224609.38250000001,393066.41940000001,265073.48619999998,463878.60070000001,290819.19510000001,508933.59139999998,315074.04259999999,551379.57460000005]
[8,"Region VIII -",null,"NORTH DAKOTA","BISMARCK","Row House",101390.6718,177433.67559999999,134991.87899999999,236235.78829999999,166205.50829999999,290859.63959999999,208908.95269999999,365590.66729999997,252579.73560000001,442014.53730000003,278875.33960000001,488031.8443,303491.85090000002,531110.73919999995]
[8,"Region VIII -",null,"NORTH DAKOTA","BISMARCK","Walkup",93369.278699999995,163396.2378,128918.1701,225606.7977,163443.66380000001,286026.4117,213299.34770000001,373273.85849999997,265664.2806,464912.49119999999,298901.9032,523078.33059999999,331625.57709999999,580344.76]
[8,"Region VIII -",null,"NORTH DAKOTA","BISMARCK","Elevator",104563.2009,167301.12400000001,146388.48130000001,234221.5736,188213.7617,301142.0232,250951.68229999999,401522.69750000001,313689.60279999999,501903.37199999997,355514.88319999998,568823.82149999996,397340.16350000002,635744.27119999996]
[8,"Region VIII -",null,"NORTH DAKOTA","FARGO","Detached/Semi-Detached",116388.7548,203680.321,151222.36379999999,264639.13660000003,180838.20550000001,316466.85950000002,215818.94070000001,377683.14620000002,254764.26759999999,445837.46840000001,279536.19809999998,489188.34669999999,302899.09999999998,530073.42480000004]
[8,"Region VIII -",null,"NORTH DAKOTA","FARGO","Row House",96887.429499999998,169553.00169999999,129153.8927,226019.31219999999,159197.00889999999,278594.76569999999,200429.41020000001,350751.46789999999,242517.91800000001,424406.35639999999,267828.85440000001,468700.4952,291546.25839999999,510205.9522]
[8,"Region VIII -",null,"NORTH DAKOTA","FARGO","Walkup",88960.032999999996,155680.05790000001,122780.84639999999,214866.48120000001,155598.52729999999,272297.4227,202930.7604,355128.83059999999,252722.55439999999,442264.47029999999,284277.8665,497486.26640000002,315329.40720000002,551826.46270000003]
[8,"Region VIII -",null,"NORTH DAKOTA","FARGO","Elevator",100332.10830000001,160531.3757,140464.9516,224743.9259,180597.79490000001,288956.47610000003,240797.05979999999,385275.3015,300996.3248,481594.12689999997,341129.16810000001,545806.67720000003,381262.01140000002,610019.22739999997]
[8,"Region VIII -",null,"NORTH DAKOTA","GRAND FORKS","Detached/Semi-Detached",118885.51549999999,208049.65229999999,154461.86180000001,270308.25819999998,184708.20740000001,323239.3628,220432.08429999999,385756.14750000002,260206.01360000001,455360.52360000001,285505.43430000002,499634.5099,309364.31150000001,541387.54520000005]
[8,"Region VIII -",null,"NORTH DAKOTA","GRAND FORKS","Row House",98990.230500000005,173232.90349999999,131947.56340000001,230908.236,162629.81539999999,284602.17690000002,204731.6545,358280.39539999998,247712.26310000001,433496.46029999998,273561.57880000002,478732.76280000003,297782.11989999999,521118.70980000001]
[8,"Region VIII -",null,"NORTH DAKOTA","GRAND FORKS","Walkup",90906.464900000006,159086.31359999999,125470.2308,219572.90400000001,159010.59899999999,278268.54830000002,207388.59469999999,362930.04070000001,258275.83929999999,451982.71889999998,290528.33630000002,508424.58860000002,322266.8848,563967.04839999997]
[8,"Region VIII -",null,"NORTH DAKOTA","GRAND FORKS","Elevator",102484.97070000001,163975.95569999999,143478.95910000001,229566.33790000001,184472.9474,295156.72019999998,245963.92980000001,393542.29359999998,307454.91230000003,491927.86700000003,348448.90059999999,557518.24919999996,389442.88890000002,623108.63150000002]
[8,"Region VIII -",null,"NORTH DAKOTA","JAMESTOWN","Detached/Semi-Detached",118333.64260000001,207083.87469999999,153798.3775,269147.1606,183961.44260000001,321932.5246,219605.68719999999,384309.95240000001,259276.2874,453733.50290000002,284504.73759999999,497883.29080000002,308314.62550000002,539550.59459999995]
[8,"Region VIII -",null,"NORTH DAKOTA","JAMESTOWN","Row House",98241.302800000005,171922.27979999999,131061.1655,229357.03959999999,161664.45300000001,282912.79269999999,203749.8077,356562.16340000002,246658.8365,431652.96389999997,272442.6262,476774.59590000001,296617.75880000001,519081.07789999997]
[8,"Region VIII -",null,"NORTH DAKOTA","JAMESTOWN","Walkup",90032.573300000004,157557.00330000001,124228.9725,217400.70180000001,157391.8413,275435.72220000002,205184.45370000001,359072.79389999999,255511.15900000001,447144.52830000001,287373.40549999999,502903.4596,318716.61479999998,557754.07590000005]
[8,"Region VIII -",null,"NORTH DAKOTA","JAMESTOWN","Elevator",102002.7317,163204.3732,142803.82440000001,228486.12239999999,183604.91699999999,293767.87160000001,244806.55609999999,391690.49550000002,306008.19510000001,489613.11940000003,346809.28779999999,554894.86869999999,387610.38040000002,620176.61789999995]
[8,"Region VIII -",null,"NORTH DAKOTA","MINOT","Detached/Semi-Detached",117133.47380000001,204983.57920000001,152276.22200000001,266483.3884,182173.59880000001,318803.79790000001,217517.04120000001,380654.82189999998,256842.55480000001,449474.47080000001,281847.86119999998,493233.75709999999,305459.76419999998,534554.58739999996]
[8,"Region VIII -",null,"NORTH DAKOTA","MINOT","Row House",97041.083899999998,169821.89679999999,129539.01,226693.26740000001,159876.60920000001,279784.06599999999,201661.1617,352907.03289999999,244225.10389999999,427393.93170000002,269785.74979999999,472125.06209999998,293762.89750000002,514085.07069999998]
[8,"Region VIII -",null,"NORTH DAKOTA","MINOT","Walkup",88801.1682,155402.04440000001,122505.00539999999,214383.75949999999,155175.31219999999,271556.79639999999,202229.0815,353900.89260000002,251816.94390000001,440679.65179999999,283186.62829999998,495576.59960000002,314037.27559999999,549565.23230000003]
[8,"Region VIII -",null,"NORTH DAKOTA","MINOT","Elevator",100963.6182,161541.79149999999,141349.06539999999,226158.50810000001,181734.51259999999,290775.22460000002,242312.68350000001,387700.29950000002,302890.85450000002,484625.37439999997,343276.30170000001,549242.09089999995,383661.74900000001,613858.80759999994]
[8,"Region VIII -",null,"NORTH DAKOTA","WILLISTON","Detached/Semi-Detached",120182.10739999999,210318.68799999999,156179.20430000001,273313.60749999998,186790.36550000001,326883.13959999999,222956.58189999999,390174.0184,263214.02669999999,460624.54670000001,288817.79399999999,505431.13939999999,312974.66190000001,547705.65839999996]
[8,"Region VIII -",null,"NORTH DAKOTA","WILLISTON","Row House",99892.812699999995,174812.4222,133219.07870000001,233133.38759999999,164274.77799999999,287480.8616,206945.25279999999,362154.1924,250472.87539999999,438327.5319,276637.42670000001,484115.49660000001,301163.1201,527035.46030000004]
[8,"Region VIII -",null,"NORTH DAKOTA","WILLISTON","Walkup",91621.491800000003,160337.61060000001,126435.6482,221262.38440000001,160206.14180000001,280360.74790000002,208891.05679999999,365559.34950000001,260134.90900000001,455236.09090000001,292592.02899999998,512036.05070000002,324525.0232,567918.7905]
[8,"Region VIII -",null,"NORTH DAKOTA","WILLISTON","Elevator",103598.7197,165757.9541,145038.20759999999,232061.13560000001,186477.6955,298364.31719999999,248636.92730000001,397819.08960000001,310796.15919999999,497273.86200000002,352235.647,563577.04359999998,393675.1349,629880.22519999999]
[8,"Region VIII -",null,"SOUTH DAKOTA","ABERDEEN","Detached/Semi-Detached",115692.24739999999,202461.43290000001,150266.09899999999,262965.67340000003,179649.96919999999,314387.4461,214338.76610000001,375092.8407,252973.12090000001,442702.96149999998,277552.27669999999,485716.48420000001,300716.1802,526253.31539999996]
[8,"Region VIII -",null,"SOUTH DAKOTA","ABERDEEN","Row House",96584.9568,169023.67439999999,128643.4552,225126.04670000001,158445.9682,277280.44439999998,199260.1349,348705.23609999998,240974.17189999999,421704.80080000003,266081.4448,465642.5282,289592.6887,506787.20539999998]
[8,"Region VIII -",null,"SOUTH DAKOTA","ABERDEEN","Walkup",88860.708799999993,155506.24040000001,122677.41250000001,214685.4719,155511.24909999999,272144.68599999999,202905.98430000001,355085.47240000003,252710.59229999999,442243.53649999999,284307.5625,497538.23430000001,315410.93849999999,551969.14229999995]
[8,"Region VIII -",null,"SOUTH DAKOTA","ABERDEEN","Elevator",99737.916100000002,159580.66819999999,139633.08249999999,223412.93539999999,179528.24900000001,287245.20260000002,239370.99859999999,382993.60350000003,299213.74829999998,478742.00439999998,339108.91470000002,542574.27159999998,379004.08110000001,606406.53890000004]
[8,"Region VIII -",null,"SOUTH DAKOTA","MITCHELL","Detached/Semi-Detached",110843.353,193975.86780000001,144079.8737,252139.77910000001,172351.42540000001,301614.99440000003,205766.24249999999,360090.92430000001,242951.0337,425164.30900000001,266597.01140000002,466544.77,288918.97129999998,505608.1998]
[8,"Region VIII -",null,"SOUTH DAKOTA","MITCHELL","Row House",91932.893500000006,160882.56359999999,122680.1449,214690.2536,151366.02340000001,264890.54090000002,190843.0619,333975.35830000002,231075.78580000001,404382.62520000001,255244.43599999999,446677.76319999999,277910.1556,486342.77230000001]
[8,"Region VIII -",null,"SOUTH DAKOTA","MITCHELL","Walkup",84193.271900000007,147338.22579999999,116160.81110000001,203281.41940000001,147155.6158,257522.32759999999,191810.9374,335669.14049999998,238851.28779999999,417989.7537,268621.97739999997,470088.46049999999,297904.16139999998,521332.28249999997]
[8,"Region VIII -",null,"SOUTH DAKOTA","MITCHELL","Elevator",95544.137799999997,152870.62289999999,133761.79300000001,214018.872,171979.44810000001,275167.12099999998,229305.9307,366889.49479999999,286632.41340000002,458611.86839999998,324850.0686,519760.11749999999,363067.72369999997,580908.36659999995]
[8,"Region VIII -",null,"SOUTH DAKOTA","PIERRE","Detached/Semi-Detached",116099.4855,203174.09959999999,150636.80239999999,263614.40429999999,179955.2616,314921.70779999997,214511.38449999999,375394.92290000001,253041.42449999999,442822.49290000001,277569.74650000001,485747.05650000001,300632.63040000002,526107.10320000001]
[8,"Region VIII -",null,"SOUTH DAKOTA","PIERRE","Row House",97780.340500000006,171115.59589999999,129905.81449999999,227335.17540000001,159625.65289999999,279344.89240000001,200054.55290000001,350095.46759999997,241537.27780000001,422690.23619999998,266571.9388,466500.89299999998,289967.83980000002,507443.71970000002]
[8,"Region VIII -",null,"SOUTH DAKOTA","PIERRE","Walkup",90509.169299999994,158391.04629999999,125056.49770000001,218848.87100000001,158661.4895,277657.6067,207289.4945,362756.6153,258227.99609999999,451898.99320000003,290647.12640000001,508632.47129999998,322593.01689999999,564537.77960000001]
[8,"Region VIII -",null,"SOUTH DAKOTA","PIERRE","Elevator",100108.2018,160173.12530000001,140151.48250000001,224242.37539999999,180194.76319999999,288311.62550000002,240259.68429999999,384415.50069999998,300324.6054,480519.37589999998,340367.88620000001,544588.62600000005,380411.16690000001,608657.87620000006]
[8,"Region VIII -",null,"SOUTH DAKOTA","RAPID CITY","Detached/Semi-Detached",115140.37450000001,201495.65530000001,149602.61480000001,261804.57579999999,178903.20449999999,313080.6078,213512.3689,373646.64559999999,252043.39480000001,441075.94079999998,276551.58010000002,483965.26510000002,299666.49410000001,524416.36470000003]
[8,"Region VIII -",null,"SOUTH DAKOTA","RAPID CITY","Row House",95836.028999999995,167713.0508,127757.0573,223574.85029999999,157480.60569999999,275591.06,198278.28810000001,346987.00400000002,239920.74540000001,419861.30440000002,264962.49229999998,463684.36139999999,288428.32760000002,504749.57329999999]
[8,"Region VIII -",null,"SOUTH DAKOTA","RAPID CITY","Walkup",87986.8171,153976.92989999999,121436.1542,212513.26980000001,153892.4914,269311.86,200701.8432,351228.22560000001,249945.91200000001,437405.34590000001,281152.63160000002,492017.1053,311860.66840000002,545756.16980000003]
[8,"Region VIII -",null,"SOUTH DAKOTA","RAPID CITY","Elevator",99255.676999999996,158809.08559999999,138957.94779999999,222332.7199,178660.21859999999,285856.3541,238213.62479999999,381141.80550000002,297767.03110000002,476427.25689999998,337469.30190000002,539950.89110000001,377171.57270000002,603474.52540000004]
[8,"Region VIII -",null,"SOUTH DAKOTA","SIOUX FALLS","Detached/Semi-Detached",120085.68799999999,210149.9541,155984.02179999999,272972.03830000001,186496.05650000001,326368.09879999998,222520.7365,389411.28899999999,262639.75349999999,459619.56849999999,288162.3186,504284.0576,312219.1814,546383.56740000006]
[8,"Region VIII -",null,"SOUTH DAKOTA","SIOUX FALLS","Row House",100190.45299999999,175333.29269999999,133469.72349999999,233572.01620000001,164417.66450000001,287730.9129,206820.30669999999,361935.5368,250146.00289999999,437755.50510000001,276218.4632,483382.31040000002,300636.98969999998,526114.73199999996]
[8,"Region VIII -",null,"SOUTH DAKOTA","SIOUX FALLS","Walkup",92137.873600000006,161241.2789,127194.20299999999,222589.8553,161227.1347,282147.48580000002,210343.97560000001,368101.95730000001,261970.0655,458447.61469999998,294715.12599999999,515751.4705,326946.23790000001,572155.91639999999]
[8,"Region VIII -",null,"SOUTH DAKOTA","SIOUX FALLS","Elevator",103524.0874,165638.5423,144933.72229999999,231893.95920000001,186343.3573,298149.3762,248457.80970000001,397532.50150000001,310572.2622,496915.62689999997,351981.8971,563171.04379999998,393391.53210000001,629426.46070000005]
[8,"Region VIII -",null,"SOUTH DAKOTA","WATERTOWN","Detached/Semi-Detached",112043.52190000001,196076.16329999999,145602.02929999999,254803.55129999999,174139.26920000001,304743.72100000002,207854.8885,363746.05489999999,245384.76629999999,429423.34110000002,269253.88799999998,471194.3039,291773.83260000002,510604.20699999999]
[8,"Region VIII -",null,"SOUTH DAKOTA","WATERTOWN","Row House",93133.112299999993,162982.9466,124202.30039999999,217354.02590000001,153153.86720000001,268019.26760000002,192931.70790000001,337630.4889,233509.51850000001,408641.65740000003,257901.3126,451327.29690000002,280765.01689999999,491338.7795]
[8,"Region VIII -",null,"SOUTH DAKOTA","WATERTOWN","Walkup",85424.676900000006,149493.18470000001,117884.7781,206298.36170000001,149372.14490000001,261401.25349999999,194766.30960000001,340841.0417,242545.50289999999,424454.63010000001,272808.75459999999,477415.32049999997,302583.50060000003,529521.12600000005]
[8,"Region VIII -",null,"SOUTH DAKOTA","WATERTOWN","Elevator",96583.251399999994,154533.20449999999,135216.55189999999,216346.48629999999,173849.85250000001,278159.76809999999,231799.80319999999,370879.69079999998,289749.75410000002,463599.61349999998,328383.05469999998,525412.89520000003,367016.35519999999,587226.17700000003]
[8,"Region VIII -",null,"UTAH","OGDEN","Detached/Semi-Detached",115365.3973,201889.44529999999,149934.39569999999,262385.1925,179334.29759999999,313835.0209,214074.5509,374630.46399999998,252740.72640000001,442296.27110000001,277331.01559999998,485329.27730000002,300536.56849999999,525938.99490000005]
[8,"Region VIII -",null,"UTAH","OGDEN","Row House",95810.292400000006,167668.0117,127805.1289,223658.9755,157633.48250000001,275858.5944,198642.62419999999,347624.59230000002,240460.63949999999,420806.11920000002,265591.41960000002,464784.98440000002,289152.45130000002,506016.78980000003]
[8,"Region VIII -",null,"UTAH","OGDEN","Walkup",87826.133499999996,153695.73370000001,121188.52959999999,212079.92679999999,153545.02979999999,268703.80219999998,200180.2733,350315.47830000002,249281.8536,436243.2438,280372.5073,490651.88780000003,310958.00189999997,544176.50320000004]
[8,"Region VIII -",null,"UTAH","OGDEN","Elevator",99444.872499999998,159111.79829999999,139222.82139999999,222756.51759999999,179000.77040000001,286401.23690000002,238667.69390000001,381868.31599999999,298334.61739999999,477335.39490000001,338112.56640000001,540980.11419999995,377890.51539999997,604624.83360000001]
[8,"Region VIII -",null,"UTAH","PROVO","Detached/Semi-Detached",114177.74950000001,199811.06159999999,148327.61309999999,259573.32279999999,177357.35380000001,310375.36900000001,211638.1133,370366.69819999998,249810.16409999999,437167.78710000002,274092.39429999999,479661.69,296986.07189999998,519725.62589999998]
[8,"Region VIII -",null,"UTAH","PROVO","Row House",95165.927500000005,166540.3731,126813.0499,221922.83730000001,156259.34080000001,273453.84639999998,196634.85260000001,344110.99190000002,237871.1918,416274.58559999999,262678.89919999999,459688.0735,285918.18119999999,500356.81709999999]
[8,"Region VIII -",null,"UTAH","PROVO","Walkup",87455.961800000005,153047.93309999999,120719.40210000001,211258.95360000001,153004.88810000001,267758.554,199586.37450000001,349276.15529999998,248565.6881,434989.95419999998,279620.4901,489335.85769999999,310184.16519999999,542822.28899999999]
[8,"Region VIII -",null,"UTAH","PROVO","Elevator",98428.799499999994,157486.08170000001,137800.31940000001,220480.51430000001,177171.83919999999,283474.94689999998,236229.1189,377966.59590000001,295286.39860000001,472458.24489999999,334657.91840000002,535452.67760000005,374029.43829999998,598447.1102]
[8,"Region VIII -",null,"UTAH","SALT LAKE CITY","Detached/Semi-Detached",114777.83379999999,200861.20929999999,149088.69089999999,260905.209,178251.27559999999,311939.73239999998,212682.4363,372194.2635,251027.03039999999,439297.30320000002,275420.83240000001,481986.45689999999,298413.5025,522223.62949999998]
[8,"Region VIII -",null,"UTAH","SALT LAKE CITY","Row House",95766.036900000006,167590.56460000001,127574.1277,223254.72339999999,157153.26269999999,275018.20970000001,197679.17559999999,345938.55719999998,239088.05809999999,418404.1017,264007.33740000002,462012.84049999999,287345.61180000001,502854.82069999998]
[8,"Region VIII -",null,"UTAH","SALT LAKE CITY","Walkup",88071.664300000004,154125.41260000001,121581.38559999999,212767.42480000001,154113.1526,269698.01699999999,201064.06049999999,351862.10590000002,250412.79560000001,438222.39240000001,281713.8787,492999.28779999999,312523.83480000001,546916.7108]
[8,"Region VIII -",null,"UTAH","SALT LAKE CITY","Elevator",98948.356299999999,158317.3725,138527.69880000001,221644.32139999999,178107.04139999999,284971.27039999998,237476.0552,379961.69390000001,296845.06890000001,474952.11749999999,336424.41149999999,538279.06640000001,376003.75400000002,601606.01540000003]
[8,"Region VIII -",null,"WYOMING","CASPER","Detached/Semi-Detached",108818.7463,190432.80609999999,141195.84940000001,247092.73639999999,168681.75520000001,295193.07160000002,201079.94010000001,351889.89510000002,237202.3149,415104.05119999999,260197.35200000001,455345.36589999998,281820.46789999999,493185.81880000001]
[8,"Region VIII -",null,"WYOMING","CASPER","Row House",91617.8033,160331.15580000001,121730.2916,213028.01029999999,149593.07620000001,261787.88329999999,187505.56090000001,328134.73149999999,226400.3872,396200.6777,249870.8561,437273.99800000002,271806.6617,475661.65789999999]
[8,"Region VIII -",null,"WYOMING","CASPER","Walkup",84785.427800000005,148374.49890000001,117144.36350000001,205002.63620000001,148618.4834,260082.34589999999,194158.8008,339777.90139999997,241868.58100000001,423270.01669999998,272229.22480000003,476401.1434,302145.51569999999,528754.65240000002]
[8,"Region VIII -",null,"WYOMING","CASPER","Elevator",93829.607999999993,150127.3751,131361.45120000001,210178.32509999999,168893.29440000001,270229.27500000002,225191.05919999999,360305.70010000002,281488.82400000002,450382.1251,319020.66720000003,510433.07510000002,356552.51040000003,570484.02520000003]
[8,"Region VIII -",null,"WYOMING","CHEYENNE","Detached/Semi-Detached",111210.7355,194618.78719999999,144296.57699999999,252519.0097,172383.50769999999,301671.1384,205489.09090000001,359605.90899999999,242400.99729999999,424201.74530000001,265898.93180000002,465323.13059999997,287993.94400000002,503989.402]
[8,"Region VIII -",null,"WYOMING","CHEYENNE","Row House",93647.670800000007,163883.4241,124421.21709999999,217737.13,152892.96090000001,267562.68150000001,191628.93470000001,335350.63559999998,231371.66020000001,404900.40529999998,255355.0356,446871.31219999999,277769.32030000002,486096.31060000003]
[8,"Region VIII -",null,"WYOMING","CHEYENNE","Walkup",86674.0818,151679.64309999999,119755.7371,209572.54,151933.94889999999,265884.4106,198495.22820000001,347366.64929999999,247271.64309999999,432725.37550000002,278312.93729999999,487047.64020000002,308900.52360000001,540575.91630000004]
[8,"Region VIII -",null,"WYOMING","CHEYENNE","Elevator",95892.473599999998,153427.9601,134249.46309999999,214799.14420000001,172606.45250000001,276170.32819999999,230141.93669999999,368227.10430000001,287677.42090000003,460283.88040000002,326034.41039999999,521655.06439999997,364391.39980000001,583026.24840000004]
[8,"Region VIII -",null,"WYOMING","ROCK SPRINGS","Detached/Semi-Detached",116582.26669999999,204018.96679999999,151343.72270000001,264851.51490000001,180870.01699999999,316522.52980000002,215699.48560000001,377474.09970000002,254512.03219999999,445396.0564,279212.24619999999,488621.43079999997,302463.93119999999,529311.87950000004]
[8,"Region VIII -",null,"WYOMING","ROCK SPRINGS","Row House",97751.655100000004,171065.3965,130034.06,227559.60509999999,159972.9374,279952.64039999997,200839.11290000001,351468.44750000001,242686.76439999999,424701.83769999997,267907.451,468838.0392,291501.44880000001,510127.53539999999]
[8,"Region VIII -",null,"WYOMING","ROCK SPRINGS","Walkup",90205.854600000006,157860.24559999999,124585.62300000001,218024.8401,157996.75080000001,276494.3138,206284.28810000001,360997.50400000002,256946.81599999999,449656.92810000002,289138.98070000001,505993.21620000002,320844.69579999999,561478.21770000004]
[8,"Region VIII -",null,"WYOMING","ROCK SPRINGS","Elevator",100514.712,160823.54149999999,140720.59669999999,225152.95809999999,180926.48149999999,289482.37479999999,241235.30869999999,385976.49969999999,301544.13589999999,482470.62469999999,341750.02069999999,546800.04130000004,381955.90549999999,611129.45790000004]
[8,"Region VIII -",null,"WYOMING","SHERIDAN","Detached/Semi-Detached",111210.7355,194618.78719999999,144296.57699999999,252519.0097,172383.50769999999,301671.1384,205489.09090000001,359605.90899999999,242400.99729999999,424201.74530000001,265898.93180000002,465323.13059999997,287993.94400000002,503989.402]
[8,"Region VIII -",null,"WYOMING","SHERIDAN","Row House",93647.670800000007,163883.4241,124421.21709999999,217737.13,152892.96090000001,267562.68150000001,191628.93470000001,335350.63559999998,231371.66020000001,404900.40529999998,255355.0356,446871.31219999999,277769.32030000002,486096.31060000003]
[8,"Region VIII -",null,"WYOMING","SHERIDAN","Walkup",86674.0818,151679.64309999999,119755.7371,209572.54,151933.94889999999,265884.4106,198495.22820000001,347366.64929999999,247271.64309999999,432725.37550000002,278312.93729999999,487047.64020000002,308900.52360000001,540575.91630000004]
[8,"Region VIII -",null,"WYOMING","SHERIDAN","Elevator",95892.473599999998,153427.9601,134249.46309999999,214799.14420000001,172606.45250000001,276170.32819999999,230141.93669999999,368227.10430000001,287677.42090000003,460283.88040000002,326034.41039999999,521655.06439999997,364391.39980000001,583026.24840000004]
[9,"Region IX - West",null,"ARIZONA","FLAGSTAFF","Detached/Semi-Detached",114202.8092,199854.916,148158.38219999999,259277.16880000001,176979.18160000001,309713.56780000002,210942.56390000001,369149.48690000002,248816.54500000001,435428.95370000001,272928.94870000001,477625.66019999998,295594.8493,517290.98639999999]
[9,"Region IX - West",null,"ARIZONA","FLAGSTAFF","Row House",96277.649000000005,168485.88570000001,127873.2215,223778.13759999999,157086.7683,274901.84450000001,196796.63149999999,344394.1053,237559.7991,415729.64840000001,262167.65279999998,458793.3922,285159.40899999999,499028.9657]
[9,"Region IX - West",null,"ARIZONA","FLAGSTAFF","Walkup",89178.439899999998,156062.26990000001,123229.09669999999,215650.91940000001,156357.68229999999,273625.94410000002,204309.3463,357541.35590000002,254521.81880000001,445413.18290000001,286490.04519999999,501357.57909999997,317995.20899999997,556491.61569999997]
[9,"Region IX - West",null,"ARIZONA","FLAGSTAFF","Elevator",98474.896099999998,157559.83609999999,137864.85449999999,220583.77059999999,177254.81289999999,283607.70490000001,236339.7507,378143.6066,295424.68829999998,472679.50839999999,334814.64679999999,535703.44279999996,374204.60519999999,598727.37730000005]
[9,"Region IX - West",null,"ARIZONA","KINGMAN","Detached/Semi-Detached",108218.66190000001,189382.65839999999,140434.77160000001,245760.85029999999,167787.8333,293628.7083,200035.6171,350062.32990000001,235985.44870000001,412974.53509999998,258868.91380000001,453020.59899999999,280393.03720000002,490687.81520000001]
[9,"Region IX - West",null,"ARIZONA","KINGMAN","Row House",91017.693899999998,159280.96429999999,120969.2138,211696.12419999999,148699.15419999999,260223.51990000001,186461.23790000001,326307.16629999998,225183.52100000001,394071.16159999999,248542.4178,434949.23119999998,270379.23109999998,473163.65429999999]
[9,"Region IX - West",null,"ARIZONA","KINGMAN","Walkup",84169.725300000006,147297.01939999999,116282.38,203494.16500000001,147510.21890000001,258142.8829,192681.11470000001,337191.95079999999,240021.47339999999,420037.5784,270135.83620000002,472737.71340000001,299805.84610000002,524660.23060000001]
[9,"Region IX - West",null,"ARIZONA","KINGMAN","Elevator",93310.051300000006,149296.08429999999,130634.0717,209014.51790000001,167958.09220000001,268732.95150000002,223944.12289999999,358310.60210000002,279930.15370000002,447888.25260000001,317254.17420000001,507606.6863,354578.19469999999,567325.11990000005]
[9,"Region IX - West",null,"ARIZONA","PHOENIX","Detached/Semi-Detached",111810.82,195668.93489999999,145057.65470000001,253850.8958,173277.4296,303235.50170000002,206533.41390000001,361433.4743,243617.86369999999,426331.26140000002,267227.37,467647.89750000002,289421.37469999999,506487.4056]
[9,"Region IX - West",null,"ARIZONA","PHOENIX","Row House",94247.780299999999,164933.61550000001,125182.29489999999,219069.01610000001,153786.88279999999,269127.04489999998,192673.25769999999,337178.2009,232588.52660000001,407029.92139999999,256683.47380000001,449196.07909999997,279196.75099999999,488594.31420000002]
[9,"Region IX - West",null,"ARIZONA","PHOENIX","Walkup",87289.784299999999,152757.1226,120617.72070000001,211081.01120000001,153042.21350000001,267823.87359999999,199972.9142,349952.59989999997,249118.75080000001,435957.8137,280406.3259,490711.07030000002,311240.19319999998,544670.33810000005]
[9,"Region IX - West",null,"ARIZONA","PHOENIX","Elevator",96412.030400000003,154259.25090000001,134976.8426,215962.95129999999,173541.65470000001,277666.65169999999,231388.87299999999,370222.2023,289236.09120000002,462777.75290000002,327800.90340000001,524481.45330000005,366365.7156,586185.15359999996]
[9,"Region IX - West",null,"ARIZONA","PRESCOTT","Detached/Semi-Detached",113598.54519999999,198797.454,147425.50580000001,257994.63510000001,176148.28400000001,308259.49699999997,210014.16070000001,367524.78110000002,247765.27590000001,433589.23269999999,271794.41149999999,475640.22,294399.28210000001,515198.74359999999]
[9,"Region IX - West",null,"ARIZONA","PRESCOTT","Row House",95492.249599999996,167111.4368,126935.44469999999,222137.0282,156054.9374,273096.14039999997,195725.34030000001,342519.34539999999,236394.82550000001,413690.94459999999,260924.41560000001,456617.72739999997,283858.43329999998,496752.25819999998]
[9,"Region IX - West",null,"ARIZONA","PRESCOTT","Walkup",88275.654599999994,154482.39559999999,121948.8265,213410.44639999999,154690.61319999999,270708.57319999998,202044.4909,353577.8591,251682.01360000001,440443.52380000002,283251.72039999999,495690.51069999998,314353.68709999998,550118.95239999995]
[9,"Region IX - West",null,"ARIZONA","PRESCOTT","Elevator",97947.653999999995,156716.2487,137126.71549999999,219402.74830000001,176305.77720000001,282089.24770000001,235074.36960000001,376118.99699999997,293842.962,470148.74619999999,333022.02350000001,532835.24569999997,372201.08510000003,595521.74509999994]
[9,"Region IX - West",null,"ARIZONA","TUCSON","Detached/Semi-Detached",109418.83070000001,191482.95379999999,141956.92720000001,248424.6225,169575.6771,296757.43489999999,202124.26310000001,353717.46039999998,238419.1813,417233.5673,261525.79019999999,457670.13280000002,283247.89850000001,495683.8224]
[9,"Region IX - West",null,"ARIZONA","TUCSON","Row House",92217.912800000006,161381.34729999999,122491.36930000001,214359.8964,150486.99799999999,263352.24660000001,188549.88389999999,329962.29670000001,227617.2536,398330.19380000001,251199.29430000001,439598.76490000001,273234.09230000002,478159.66159999999]
[9,"Region IX - West",null,"ARIZONA","TUCSON","Walkup",85401.130399999995,149451.97820000001,118006.3471,206511.10740000001,149726.74789999999,262021.8089,195636.48680000001,342363.85190000001,243715.68849999999,426502.45500000002,274322.61339999997,480064.5735,304485.18520000001,532849.07420000003]
[9,"Region IX - West",null,"ARIZONA","TUCSON","Elevator",94349.164799999999,150958.66589999999,132088.83059999999,211342.13219999999,169828.49660000001,271725.59860000003,226437.99540000001,362300.79810000001,283047.49430000002,452875.9976,320787.16029999999,513259.46399999998,358526.82610000001,573642.93039999995]
[9,"Region IX - West",null,"CALIFORNIA","BAKERSFIELD","Detached/Semi-Detached",140510.50030000001,245893.37539999999,182294.5724,319015.50160000002,217761.46410000001,381082.56219999999,259559.11859999999,454228.45750000002,306167.61940000003,535793.33400000003,335840.196,587720.34290000005,363734.91470000002,636536.10080000001]
[9,"Region IX - West",null,"CALIFORNIA","BAKERSFIELD","Row House",118420.8992,207236.5736,157296.6972,275269.22019999998,193247.58069999999,338183.26620000001,242126.7573,423721.82520000002,292295.66970000003,511517.42190000002,322578.80070000002,564512.90130000003,350875.07880000002,614031.38809999998]
[9,"Region IX - West",null,"CALIFORNIA","BAKERSFIELD","Walkup",109666.5511,191916.4644,151535.92170000001,265187.86290000001,192269.00229999999,336470.75410000002,251222.88440000001,439640.0477,312962.81349999999,547684.92350000003,352265.95649999997,616465.42390000005,390998.45679999999,684247.29940000002]
[9,"Region IX - West",null,"CALIFORNIA","BAKERSFIELD","Elevator",121158.72380000001,193853.96109999999,169622.21340000001,271395.5454,218085.70300000001,348937.1299,290780.93729999999,465249.50650000002,363476.1716,581561.88309999998,411939.66110000003,659103.46750000003,460403.15059999999,736645.05189999996]
[9,"Region IX - West",null,"CALIFORNIA","EUREKA","Detached/Semi-Detached",147111.43609999999,257445.01319999999,190666.43700000001,333666.2647,227594.61559999999,398290.5773,271046.68410000001,474331.6972,319553.16360000003,559218.03630000004,350453.03230000002,613292.80649999995,379436.66879999998,664014.1703]
[9,"Region IX - West",null,"CALIFORNIA","EUREKA","Row House",125022.11010000001,218788.69260000001,165668.5618,289919.98310000001,203080.7322,355391.28139999998,253614.32279999999,443825.0649,305681.21389999997,534942.12419999996,337191.63709999999,590085.36490000004,366576.83289999998,641509.45759999997]
[9,"Region IX - West",null,"CALIFORNIA","EUREKA","Walkup",116439.2862,203768.75090000001,161017.75090000001,281781.06390000001,204459.92559999999,357804.86979999999,267477.44870000001,468085.53519999998,333281.01880000002,583241.78289999999,375293.25589999999,656763.19790000003,416734.85029999999,729285.98789999995]
[9,"Region IX - West",null,"CALIFORNIA","EUREKA","Elevator",126873.8545,202998.17019999999,177623.39619999999,284197.43829999998,228372.9381,365396.70630000002,304497.25079999998,487195.60849999997,380621.56349999999,608994.51060000004,431371.1053,690193.77870000002,482120.6471,771393.04680000001]
[9,"Region IX - West",null,"CALIFORNIA","FRESNO","Detached/Semi-Detached",145898.73920000001,255322.7935,189228.89910000001,331150.57339999999,225995.86060000001,395492.75599999999,269305.81589999999,471285.1777,317616.24410000001,555828.42709999997,348377.88260000001,609661.29449999996,377277.42300000001,660235.49029999995]
[9,"Region IX - West",null,"CALIFORNIA","FRESNO","Row House",123266.03230000001,215715.55650000001,163616.32269999999,286328.56479999999,200879.17739999999,351538.56030000001,251444.79029999999,440028.38309999998,303403.18119999999,530955.56700000004,334790.38780000003,585883.17870000005,364101.36190000002,637177.3835]
[9,"Region IX - West",null,"CALIFORNIA","FRESNO","Walkup",114346.6439,200106.6269,158038.93900000001,276568.14319999999,200567.00270000001,350992.25459999999,262160.59509999998,458781.04129999998,326608.7438,571565.30169999995,367671.70740000001,643425.48809999996,408149.99619999999,714262.49329999997]
[9,"Region IX - West",null,"CALIFORNIA","FRESNO","Elevator",125811.6943,201298.7138,176136.372,281818.19929999998,226461.0496,362337.68479999999,301948.0662,483116.913,377435.08270000003,603896.14130000002,427759.76030000002,684415.62679999997,478084.43800000002,764935.11230000004]
[9,"Region IX - West",null,"CALIFORNIA","LOS ANGELES","Detached/Semi-Detached",139327.02840000001,243822.2997,180659.58379999999,316154.27169999998,215721.49059999999,377512.60859999998,257006.75510000001,449761.82140000002,303071.45270000002,530375.04220000003,332407.66570000001,581713.41489999997,359952.54629999999,629916.95609999995]
[9,"Region IX - West",null,"CALIFORNIA","LOS ANGELES","Row House",117961.82060000001,206433.18609999999,156481.31280000001,273842.29739999998,192011.34270000001,336019.84970000002,240145.94769999999,420255.40850000002,289654.32189999998,506895.06329999998,319581.07120000001,559266.87450000003,347514.34529999999,608150.10419999994]
[9,"Region IX - West",null,"CALIFORNIA","LOS ANGELES","Walkup",109583.45849999999,191771.05230000001,151485.07569999999,265098.8824,192287.65849999999,336503.40240000002,251416.14610000001,439978.25550000003,313239.3346,548168.83550000004,352658.86310000002,617153.01040000003,391526.4584,685171.30240000004]
[9,"Region IX - West",null,"CALIFORNIA","LOS ANGELES","Elevator",120150.33319999999,192240.53599999999,168210.46650000001,269136.75030000001,216270.59969999999,346032.96460000001,288360.79969999997,461377.28629999998,360450.99949999998,576721.6078,408511.13280000002,653617.82220000005,456571.266,730514.03659999999]
[9,"Region IX - West",null,"CALIFORNIA","MARYSVILLE","Detached/Semi-Detached",139939.64799999999,244894.3841,181336.05290000001,317338.09269999998,216426.33439999999,378746.08519999997,257703.31280000001,450980.79729999998,303791.52039999998,531635.16059999994,333154.39299999998,583020.18759999995,360684.37849999999,631197.66229999997]
[9,"Region IX - West",null,"CALIFORNIA","MARYSVILLE","Row House",119117.79610000001,208456.14319999999,157772.48310000001,276101.8456,193318.98629999999,338308.22600000002,241271.16959999999,422224.54680000001,290715.50280000002,508752.1299,320653.89809999999,561144.32149999996,348562.40250000003,609984.20460000006]
[9,"Region IX - West",null,"CALIFORNIA","MARYSVILLE","Walkup",111060.40549999999,194355.70970000001,153601.9143,268803.34999999998,195072.33009999999,341376.57770000002,255255.33119999999,446696.8296,318064.52399999998,556612.91709999996,358187.04790000001,626827.33389999997,397771.67080000002,696100.42409999995]
[9,"Region IX - West",null,"CALIFORNIA","MARYSVILLE","Elevator",120692.94289999999,193108.7115,168970.12,270352.1961,217247.2971,347595.68060000002,289663.06280000001,463460.90749999997,362078.82860000001,579326.13430000003,410356.00569999998,656569.6189,458633.18280000001,733813.10349999997]
[9,"Region IX - West",null,"CALIFORNIA","MODESTO","Detached/Semi-Detached",143510.92240000001,251144.11420000001,186099.96119999999,325674.93219999998,222231.0736,388904.37880000001,264780.73369999998,463366.28389999998,312251.951,546440.91440000001,342482.38709999999,599344.17740000004,370872.06790000002,649026.11880000005]
[9,"Region IX - West",null,"CALIFORNIA","MODESTO","Row House",121421.4463,212487.53109999999,161102.08609999999,281928.6507,197717.19020000001,346005.08289999998,247348.37229999999,432859.65159999998,298380.0013,522165.0024,329220.99190000002,576136.73580000002,358012.23200000002,626521.40619999997]
[9,"Region IX - West",null,"CALIFORNIA","MODESTO","Walkup",112745.0637,197303.8615,155845.83929999999,272730.21889999998,197810.32509999999,346168.06890000001,258611.31469999999,452569.80070000002,322198.35129999998,563847.11479999998,362732.8995,634782.57409999997,402696.80479999998,704719.40839999996]
[9,"Region IX - West",null,"CALIFORNIA","MODESTO","Elevator",123756.5077,198010.41519999999,173259.11069999999,277214.58130000002,222761.7139,356418.74739999999,297015.61849999998,475224.99660000001,371269.52309999999,594031.24580000003,420772.1262,673235.4118,470274.7292,752439.57790000003]
[9,"Region IX - West",null,"CALIFORNIA","PALM SPRINGS","Detached/Semi-Detached",137522.60620000001,240664.56090000001,178404.56580000001,312207.9902,213102.7659,372929.84039999999,253989.72579999999,444482.02020000003,299586.47450000001,524276.33049999998,328616.2781,575078.48659999995,355902.14600000001,622828.75560000003]
[9,"Region IX - West",null,"CALIFORNIA","PALM SPRINGS","Row House",115976.211,202958.36919999999,154021.39189999999,269537.43589999998,189191.68229999999,331085.44410000002,236986.0287,414725.5502,286055.63799999998,500597.3665,315680.98239999998,552441.71920000005,343358.53539999999,600877.43689999997]
[9,"Region IX - West",null,"CALIFORNIA","PALM SPRINGS","Walkup",107449.27559999999,188036.23250000001,148480.84880000001,259841.4853,188404.0735,329707.1286,246195.93549999999,430842.8872,306705.33539999998,536734.33689999999,345233.78480000002,604159.12349999999,383205.6238,670609.84160000004]
[9,"Region IX - West",null,"CALIFORNIA","PALM SPRINGS","Elevator",118583.98669999999,189734.38159999999,166017.5814,265628.13429999998,213451.17610000001,341521.88689999998,284601.56819999998,455362.51579999999,355751.96019999997,569203.14469999995,403185.55489999999,645096.89740000002,450619.1495,720990.65009999997]
[9,"Region IX - West",null,"CALIFORNIA","REDDING","Detached/Semi-Detached",146490.4644,256358.31270000001,190046.37959999999,332581.1643,227015.83100000001,397277.70419999998,270581.97830000002,473518.462,319164.30469999998,558537.53319999995,350094.12280000001,612664.71490000002,379168.58029999997,663545.01549999998]
[9,"Region IX - West",null,"CALIFORNIA","REDDING","Row House",123495.56200000001,216117.23329999999,164024.00229999999,287042.00420000002,201497.2812,352620.24209999997,252435.17670000001,441761.55900000001,304723.83299999998,533266.70770000003,336289.22840000002,588506.1496,365781.70250000001,640117.97939999995]
[9,"Region IX - West",null,"CALIFORNIA","REDDING","Walkup",114388.18090000001,200179.31659999999,158064.34899999999,276612.61080000002,200557.658,350975.90159999998,262063.9425,458611.89939999999,326470.45610000001,571323.29819999996,367475.22350000002,643081.64119999995,407885.96120000002,713800.43220000004]
[9,"Region IX - West",null,"CALIFORNIA","REDDING","Elevator",126315.88039999999,202105.41149999999,176842.23250000001,282947.57610000001,227368.5845,363789.74070000002,303158.1127,485052.9877,378947.641,606316.23459999997,429473.99310000002,687158.39910000004,480000.34519999998,768000.5638]
[9,"Region IX - West",null,"CALIFORNIA","RIVERSIDE","Detached/Semi-Detached",136935.04269999999,239636.3248,177558.8609,310728.00650000002,212019.7438,371034.55170000001,252597.61120000001,442045.81959999999,297872.77860000002,521277.36249999999,326706.09490000003,571735.66610000003,353779.08,619113.39020000002]
[9,"Region IX - West",null,"CALIFORNIA","RIVERSIDE","Row House",115931.9555,202880.9222,153790.39069999999,269133.1838,188711.46249999999,330245.05930000002,236022.58,413039.51500000001,284683.05660000001,498195.34899999999,314096.90019999997,549669.57519999996,341551.69579999999,597715.46770000004]
[9,"Region IX - West",null,"CALIFORNIA","RIVERSIDE","Walkup",107694.80650000001,188465.91140000001,148873.7047,260528.98319999999,188972.19630000001,330701.34340000001,247079.72270000001,432389.5148,307836.27750000003,538713.48560000001,346575.15620000003,606506.52339999995,384771.45669999998,673350.04920000001]
[9,"Region IX - West",null,"CALIFORNIA","RIVERSIDE","Elevator",118087.4706,188939.9558,165322.45879999999,264515.93800000002,212557.44699999999,340091.9203,283409.92940000002,453455.89380000002,354262.4118,566819.86730000004,401497.4,642395.84950000001,448732.38819999999,717971.83180000004]
[9,"Region IX - West",null,"CALIFORNIA","SACRAMENTO","Detached/Semi-Detached",145307.0068,254287.26190000001,188411.40950000001,329719.96669999999,224975.87950000001,393707.7892,268029.641,469051.87170000002,316068.16899999999,553119.29570000002,346661.62650000001,606657.84640000004,375386.2487,656925.93519999995]
[9,"Region IX - West",null,"CALIFORNIA","SACRAMENTO","Row House",123036.4955,215313.8671,163208.63399999999,285615.10950000002,200261.06280000001,350456.86,250454.39170000001,438295.18530000001,302082.5148,528644.40099999995,333291.53149999998,583260.1801,362421.00449999998,634236.75780000002]
[9,"Region IX - West",null,"CALIFORNIA","SACRAMENTO","Walkup",114305.0995,200033.92420000001,158013.51860000001,276523.65759999998,200576.334,351008.5845,262257.23,458950.15250000003,326747.00949999999,571807.26650000003,367868.16639999999,643769.29119999998,408414.00319999998,714724.50549999997]
[9,"Region IX - West",null,"CALIFORNIA","SACRAMENTO","Elevator",125307.50199999999,200492.0062,175430.50270000001,280688.80859999999,225553.50339999999,360885.61099999998,300738.00469999999,481180.81469999999,375922.50579999998,601476.0183,426045.50660000002,681672.82070000004,476168.5074,761869.62320000003]
[9,"Region IX - West",null,"CALIFORNIA","SALINAS","Detached/Semi-Detached",142339.98569999999,249094.97510000001,184380.364,322665.63709999999,220002.022,385003.53850000002,261880.6048,458291.05839999998,308658.98570000002,540153.22499999998,338468.1459,592319.25529999996,366394.10100000002,641189.67669999995]
[9,"Region IX - West",null,"CALIFORNIA","SALINAS","Row House",121518.23390000001,212656.90919999999,160816.79430000001,281429.38990000001,196894.67389999999,344565.67930000002,245448.46170000001,429534.80780000001,295582.9681,517270.19420000003,325967.65090000001,570443.38919999998,354272.1251,619976.21900000004]
[9,"Region IX - West",null,"CALIFORNIA","SALINAS","Walkup",113523.2156,198665.62729999999,157049.84839999999,274837.23469999997,199505.38829999999,349134.42959999997,261166.07550000001,457040.63199999998,325452.95439999999,569542.67009999999,366560.60230000003,641481.05390000006,407130.3493,712478.11120000004]
[9,"Region IX - West",null,"CALIFORNIA","SALINAS","Elevator",122771.16989999999,196433.87479999999,171879.6379,275007.42479999998,220988.10579999999,353580.97470000002,294650.80780000001,471441.29960000003,368313.5098,589301.62450000003,417421.97779999999,667875.17429999996,466530.44579999999,746448.72439999995]
[9,"Region IX - West",null,"CALIFORNIA","SAN BERNADINO","Detached/Semi-Detached",135743.22589999999,237550.64540000001,175980.2936,307965.51370000001,210105.84090000001,367685.22159999999,250277.1133,437984.94839999999,295107.8371,516438.71500000003,323661.4007,566407.45109999995,350460.47509999998,613305.83160000003]
[9,"Region IX - West",null,"CALIFORNIA","SAN BERNADINO","Row House",115102.30929999999,201429.04130000001,152621.62419999999,267087.84230000002,187199.42610000001,327598.99560000002,233987.85829999999,409478.75199999998,282145.52399999998,493754.66680000001,311269.60550000001,544721.80969999998,338443.90769999998,592276.83849999995]
[9,"Region IX - West",null,"CALIFORNIA","SAN BERNADINO","Walkup",107037.55959999999,187315.72930000001,147986.3008,258976.02650000001,187873.26310000001,328778.21039999998,245698.67170000001,429972.67540000001,306127.43560000003,535723.01229999994,344678.22659999999,603186.89659999998,382695.7941,669717.63970000006]
[9,"Region IX - West",null,"CALIFORNIA","SAN BERNADINO","Elevator",117063.7216,187301.95730000001,163889.2101,262222.7402,210714.69880000001,337143.52299999999,280952.93170000002,449524.6973,351191.16460000002,561905.87170000002,398016.6532,636826.65460000001,444842.14179999998,711747.4375]
[9,"Region IX - West",null,"CALIFORNIA","SAN DIEGO","Detached/Semi-Detached",136343.31039999999,238600.79319999999,176741.3714,309297.39980000001,210999.7628,369249.58490000002,251321.43640000001,439812.51360000001,296324.7034,518568.23109999998,324989.83889999997,568732.21790000005,351887.9057,615803.83519999997]
[9,"Region IX - West",null,"CALIFORNIA","SAN DIEGO","Row House",115702.41869999999,202479.2328,153382.70199999999,268419.72840000002,188093.348,329163.359,235032.1813,411306.3173,283362.39020000002,495884.18290000001,312598.04379999998,547046.57660000003,339871.3383,594774.84199999995]
[9,"Region IX - West",null,"CALIFORNIA","SAN DIEGO","Walkup",107653.26210000001,188393.20869999999,148848.2844,260484.49770000001,188981.5276,330717.67330000002,247176.35769999999,432558.62599999999,307974.54310000001,538955.45050000004,346771.6152,606850.32660000003,385035.46370000002,673812.06149999995]
[9,"Region IX - West",null,"CALIFORNIA","SAN DIEGO","Elevator",117583.27830000001,188133.2481,164616.58970000001,263386.54729999998,211649.90090000001,338639.84649999999,282199.86790000001,451519.7953,352749.83490000002,564399.74419999996,399783.14620000002,639653.04339999997,446816.45750000002,714906.34270000004]
[9,"Region IX - West",null,"CALIFORNIA","SAN FRANCISCO","Detached/Semi-Detached",163830.29380000001,286703.01400000002,212540.75109999999,371946.31439999997,253885.04240000001,444298.82419999997,302606.27289999998,529560.97759999998,356937.53970000002,624640.69440000004,391527.51500000001,685173.15130000003,424042.20010000002,742073.85019999999]
[9,"Region IX - West",null,"CALIFORNIA","SAN FRANCISCO","Row House",138119.45989999999,241709.05480000001,183444.8653,321028.51409999997,225352.49110000001,394366.85940000002,282316.14850000001,494053.2599,340791.50079999998,596385.12620000006,376092.1214,658161.21259999997,409074.19530000002,715879.84169999999]
[9,"Region IX - West",null,"CALIFORNIA","SAN FRANCISCO","Walkup",127937.3866,223890.42660000001,176787.6735,309378.42859999998,224315.39360000001,392551.9387,293109.4743,512941.57990000001,365146.3309,639006.07889999996,411009.6973,719266.97030000004,456208.87310000003,798365.52800000005]
[9,"Region IX - West",null,"CALIFORNIA","SAN FRANCISCO","Elevator",141267.81150000001,226028.5018,197774.93599999999,316439.90240000002,254282.0606,406851.30300000001,339042.7475,542468.40410000004,423803.43440000003,678085.50509999995,480310.55900000001,768496.90579999995,536817.68350000004,858908.30649999995]
[9,"Region IX - West",null,"CALIFORNIA","SAN JOSE","Detached/Semi-Detached",157258.5901,275202.53269999998,203971.44519999999,356950.02909999999,243610.6838,426318.69660000002,290307.22600000002,508037.64549999998,342392.7648,599187.33840000001,375557.31630000001,657225.30350000004,406717.3432,711755.35069999995]
[9,"Region IX - West",null,"CALIFORNIA","SAN JOSE","Row House",132815.25320000001,232426.69320000001,176309.8622,308542.25890000002,216484.6655,378848.16450000001,271017.31809999997,474280.30660000001,327042.65659999999,572324.64899999998,360882.82160000002,631544.93790000002,392487.19709999999,686852.59499999997]
[9,"Region IX - West",null,"CALIFORNIA","SAN JOSE","Walkup",123174.205,215554.85879999999,170233.81539999999,297909.17700000003,216036.05609999999,378063.098,282365.03340000001,494138.80859999999,351776.93170000002,615609.63060000003,395996.86430000002,692994.51249999995,439585.34779999999,769274.35860000004]
[9,"Region IX - West",null,"CALIFORNIA","SAN JOSE","Elevator",135606.4565,216970.33369999999,189849.03909999999,303758.46710000001,244091.62169999999,390546.6005,325455.49560000002,520728.80070000002,406819.36959999998,650911.00100000005,461061.9522,737699.13439999998,515304.53470000002,824487.26789999998]
[9,"Region IX - West",null,"CALIFORNIA","SAN LUIS OBISPO","Detached/Semi-Detached",140527.1972,245922.59520000001,182181.73929999999,318818.04389999999,217509.33439999999,380641.33519999997,259095.40109999999,453416.95189999999,305505.18540000002,534634.07440000004,335064.54210000002,586362.94869999995,362807.40759999998,634912.96329999994]
[9,"Region IX - West",null,"CALIFORNIA","SAN LUIS OBISPO","Row House",119162.0395,208533.56909999999,158003.46830000001,276506.06959999999,193799.18650000001,339148.57630000002,242234.5938,423910.53909999999,292088.05459999997,511154.0955,322237.94760000001,563916.40839999996,350369.20659999998,613146.1115]
[9,"Region IX - West",null,"CALIFORNIA","SAN LUIS OBISPO","Walkup",110814.86350000001,193926.0111,153209.04269999999,268115.8248,194504.18770000001,340382.3284,254371.51809999999,445150.1568,316933.54969999997,554633.71200000006,356845.64020000002,624479.87049999996,396205.7977,693360.1459]
[9,"Region IX - West",null,"CALIFORNIA","SAN LUIS OBISPO","Elevator",121189.4467,193903.1177,169665.2254,271464.36469999998,218141.00399999999,349025.61170000001,290854.67210000003,465367.48229999997,363568.34009999997,581709.35290000006,412044.1189,659270.59990000003,460519.89750000002,736831.84699999995]
[9,"Region IX - West",null,"CALIFORNIA","SAN MATEO","Detached/Semi-Detached",159063.02660000001,278360.2965,206226.4817,360896.34289999999,246229.43049999999,430901.50349999999,293324.28149999998,513317.4926,345877.77399999998,605286.10439999995,379348.73790000001,663860.29130000004,410767.78039999999,718843.61549999996]
[9,"Region IX - West",null,"CALIFORNIA","SAN MATEO","Row House",134800.8749,235901.5312,178769.79920000001,312847.14840000001,219304.34539999999,383782.60460000002,274177.26169999997,479810.20789999998,330641.3701,578622.39769999997,364782.94319999998,638370.15040000004,396643.04259999999,694125.32449999999]
[9,"Region IX - West",null,"CALIFORNIA","SAN MATEO","Walkup",125308.399,219289.69829999999,173238.05790000001,303166.60139999999,219919.66080000001,384859.40639999998,287585.2697,503274.22200000001,358310.9632,627044.18550000002,403421.97879999998,705988.46290000004,447906.22279999999,783835.88989999995]
[9,"Region IX - West",null,"CALIFORNIA","SAN MATEO","Elevator",137172.81529999999,219476.50769999999,192041.94140000001,307267.11070000002,246911.0675,395057.71380000003,329214.75660000002,526743.61840000004,411518.44579999999,658429.52300000004,466387.57189999998,746220.12609999999,521256.69799999997,834010.72919999994]
[9,"Region IX - West",null,"CALIFORNIA","SANTA BARBARA","Detached/Semi-Detached",141706.49299999999,247986.36290000001,183844.9338,321728.63410000002,219612.33749999999,384321.5906,261763.6905,458086.4584,308766.95640000002,540342.17379999999,338690.98129999998,592709.21730000002,366821.64789999998,641937.88379999995]
[9,"Region IX - West",null,"CALIFORNIA","SANTA BARBARA","Row House",119435.8317,209012.70559999999,158642.15830000001,277623.777,194897.5208,341070.66149999999,244188.4411,427329.772,294781.30229999998,515867.27909999999,325320.88620000001,569311.55090000003,353856.40360000002,619248.70629999996]
[9,"Region IX - West",null,"CALIFORNIA","SANTA BARBARA","Walkup",110610.87699999999,193569.03479999999,152841.60709999999,267472.8125,193926.7335,339371.78360000002,253391.09599999999,443434.41800000001,315664.3419,552412.59849999996,355307.80989999999,621788.66740000003,394375.95760000002,690157.92590000003]
[9,"Region IX - West",null,"CALIFORNIA","SANTA BARBARA","Elevator",122190.15519999999,195504.2512,171066.21720000001,273705.95159999997,219942.27919999999,351907.652,293256.37239999999,469210.20270000002,366570.46539999999,586512.75340000005,415446.52750000003,664714.45380000002,464322.5895,742916.15430000005]
[9,"Region IX - West",null,"CALIFORNIA","SANTA CRUZ","Detached/Semi-Detached",147111.43609999999,257445.01319999999,190666.43700000001,333666.2647,227594.61559999999,398290.5773,271046.68410000001,474331.6972,319553.16360000003,559218.03630000004,350453.03230000002,613292.80649999995,379436.66879999998,664014.1703]
[9,"Region IX - West",null,"CALIFORNIA","SANTA CRUZ","Row House",125022.11010000001,218788.69260000001,165668.5618,289919.98310000001,203080.7322,355391.28139999998,253614.32279999999,443825.0649,305681.21389999997,534942.12419999996,337191.63709999999,590085.36490000004,366576.83289999998,641509.45759999997]
[9,"Region IX - West",null,"CALIFORNIA","SANTA CRUZ","Walkup",116439.2862,203768.75090000001,161017.75090000001,281781.06390000001,204459.92559999999,357804.86979999999,267477.44870000001,468085.53519999998,333281.01880000002,583241.78289999999,375293.25589999999,656763.19790000003,416734.85029999999,729285.98789999995]
[9,"Region IX - West",null,"CALIFORNIA","SANTA CRUZ","Elevator",126873.8545,202998.17019999999,177623.39619999999,284197.43829999998,228372.9381,365396.70630000002,304497.25079999998,487195.60849999997,380621.56349999999,608994.51060000004,431371.1053,690193.77870000002,482120.6471,771393.04680000001]
[9,"Region IX - West",null,"CALIFORNIA","SANTA ROSA","Detached/Semi-Detached",147111.43609999999,257445.01319999999,190666.43700000001,333666.2647,227594.61559999999,398290.5773,271046.68410000001,474331.6972,319553.16360000003,559218.03630000004,350453.03230000002,613292.80649999995,379436.66879999998,664014.1703]
[9,"Region IX - West",null,"CALIFORNIA","SANTA ROSA","Row House",125022.11010000001,218788.69260000001,165668.5618,289919.98310000001,203080.7322,355391.28139999998,253614.32279999999,443825.0649,305681.21389999997,534942.12419999996,337191.63709999999,590085.36490000004,366576.83289999998,641509.45759999997]
[9,"Region IX - West",null,"CALIFORNIA","SANTA ROSA","Walkup",116439.2862,203768.75090000001,161017.75090000001,281781.06390000001,204459.92559999999,357804.86979999999,267477.44870000001,468085.53519999998,333281.01880000002,583241.78289999999,375293.25589999999,656763.19790000003,416734.85029999999,729285.98789999995]
[9,"Region IX - West",null,"CALIFORNIA","SANTA ROSA","Elevator",126873.8545,202998.17019999999,177623.39619999999,284197.43829999998,228372.9381,365396.70630000002,304497.25079999998,487195.60849999997,380621.56349999999,608994.51060000004,431371.1053,690193.77870000002,482120.6471,771393.04680000001]
[9,"Region IX - West",null,"CALIFORNIA","STOCKTON","Detached/Semi-Detached",141727.37330000001,248022.9032,183703.90400000001,321481.83199999999,219297.18890000001,383770.08049999998,261184.05960000001,457072.1042,307938.9326,538893.13190000004,337721.43449999997,591012.51020000002,365662.28580000001,639909.00029999996]
[9,"Region IX - West",null,"CALIFORNIA","STOCKTON","Row House",120362.26549999999,210633.96460000001,159525.6329,279169.85769999999,195587.04089999999,342277.32160000002,244323.25219999999,427565.69130000001,294521.80170000001,515413.1531,324894.83990000002,568565.96979999996,353224.08480000001,618142.14850000001]
[9,"Region IX - West",null,"CALIFORNIA","STOCKTON","Walkup",112046.27589999999,196080.9828,154933.02009999999,271132.78519999998,196720.73,344261.27740000002,257326.90789999999,450322.08870000002,320627.7868,561098.62710000004,361032.4424,631806.77419999999,400885.16470000002,701549.03839999996]
[9,"Region IX - West",null,"CALIFORNIA","STOCKTON","Elevator",122228.5664,195565.70929999999,171119.99299999999,273791.99290000001,220011.41959999999,352018.27659999998,293348.55949999997,469357.70209999999,366685.69929999998,586697.12769999995,415577.12589999998,664923.41130000004,464468.55249999999,743149.69499999995]
[9,"Region IX - West",null,"CALIFORNIA","SUSANVILLE","Detached/Semi-Detached",141131.46479999999,246980.06349999999,182914.62030000001,320100.58549999999,218340.23740000001,382095.4154,260023.8106,455041.66859999998,306556.46189999999,536473.80819999997,336199.08730000001,588348.40269999998,364002.98340000003,637005.22100000002]
[9,"Region IX - West",null,"CALIFORNIA","SUSANVILLE","Row House",119947.4423,209908.02420000001,158941.24969999999,278147.18699999998,194831.02280000001,340954.28970000002,243305.89129999999,425785.30979999999,293253.0355,513192.81199999998,323481.19260000001,566092.08700000006,351670.19079999998,615422.83389999997]
[9,"Region IX - West",null,"CALIFORNIA","SUSANVILLE","Walkup",111717.65240000001,195505.89180000001,154489.31820000001,270356.30670000002,196171.26329999999,343299.7108,256636.3823,449113.6691,319773.36589999998,559603.39040000003,360083.97759999998,630146.96070000005,399847.3334,699732.83349999995]
[9,"Region IX - West",null,"CALIFORNIA","SUSANVILLE","Elevator",121716.69190000001,194746.71,170403.36869999999,272645.39390000002,219090.04550000001,350544.07789999997,292120.06050000002,467392.10389999999,365150.07579999999,584240.12990000006,413836.7525,662138.81389999995,462523.42920000001,740037.49789999996]
[9,"Region IX - West",null,"HAWAII","HILO","Detached/Semi-Detached",165538.67430000001,289692.6801,215444.51490000001,377027.90110000002,257953.46030000001,451418.55550000002,308289.61499999999,539506.82629999996,364231.43910000002,637405.01839999994,399778.83059999999,699612.95349999995,433425.67800000001,758494.93660000002]
[9,"Region IX - West",null,"HAWAII","HILO","Row House",135843.48490000001,237726.0986,181840.81510000001,318221.42629999999,225000.37220000001,393750.65130000003,284855.9498,498497.91200000001,345583.9008,604771.82629999996,381952.03759999998,668416.06570000004,416138.68609999999,728242.70079999999]
[9,"Region IX - West",null,"HAWAII","HILO","Walkup",123468.7476,216070.3083,170171.41889999999,297799.98320000002,215346.6188,376856.58299999998,280224.98269999999,490393.71960000001,348848.52429999999,610484.91760000004,392101.51299999998,686177.64769999997,434587.4081,760527.96420000005]
[9,"Region IX - West",null,"HAWAII","HILO","Elevator",142657.47229999999,228251.95910000001,199720.46109999999,319552.7426,256783.45009999999,410853.52620000002,342377.93349999998,547804.70160000003,427972.41680000001,684755.87710000004,485035.4057,776056.66059999994,542098.3946,867357.44429999997]
[9,"Region IX - West",null,"NEVADA","CARSON CITY","Detached/Semi-Detached",118974.2524,208204.9417,154444.44570000001,270277.77990000002,184571.76379999999,323000.58669999999,220108.62940000001,385190.10149999999,259710.7064,454493.73619999998,284913.81689999998,498599.17969999998,308637.39730000001,540115.44539999997]
[9,"Region IX - West",null,"NEVADA","CARSON CITY","Row House",99781.520199999999,174617.66029999999,132724.98209999999,232268.71859999999,163272.81760000001,285727.43070000003,204962.48060000001,358684.34100000001,247658.02970000001,433401.55200000003,273391.62199999997,478435.33850000001,297464.09820000001,520562.17190000002]
[9,"Region IX - West",null,"NEVADA","CARSON CITY","Walkup",92094.506599999993,161165.38649999999,127196.9938,222594.73929999999,161312.21299999999,282296.37280000001,210620.71119999999,368586.24469999998,262349.87310000003,459112.27799999999,295222.6875,516639.70319999999,327599.69760000001,573299.47080000001]
[9,"Region IX - West",null,"NEVADA","CARSON CITY","Elevator",102577.57460000001,164124.12169999999,143608.60440000001,229773.77040000001,184639.6342,295423.4191,246186.1789,393897.8922,307732.72360000003,492372.3652,348763.75349999999,558022.01379999996,389794.78330000001,623671.66260000004]
[9,"Region IX - West",null,"NEVADA","ELKO","Detached/Semi-Detached",127342.0368,222848.56450000001,165325.19570000001,289319.09240000002,197590.92370000001,345784.1165,235656.57889999999,412399.01309999998,278071.69390000001,486625.4644,305063.24959999998,533860.68669999996,330476.42920000001,578333.75120000006]
[9,"Region IX - West",null,"NEVADA","ELKO","Row House",106700.77009999999,186726.34779999999,141966.5264,248441.42110000001,174684.50889999999,305697.89059999998,219367.32380000001,383892.81670000002,265109.38069999998,463941.41619999998,292671.45449999999,512175.0453,318459.86170000001,557304.75809999998]
[9,"Region IX - West",null,"NEVADA","ELKO","Walkup",98417.716799999995,172231.00459999999,135918.52100000001,237857.4118,172357.54620000001,301625.7059,225011.04920000001,393769.33600000001,280267.90740000003,490468.83809999999,315370.76140000002,551898.83250000002,349940.39189999999,612395.68570000003]
[9,"Region IX - West",null,"NEVADA","ELKO","Elevator",109789.9206,175663.87549999999,153705.88879999999,245929.42569999999,197621.85699999999,316194.97590000002,263495.80940000003,421593.30129999999,329369.76179999998,526991.62659999996,373285.73,597257.17689999996,417201.69819999998,667522.72699999996]
[9,"Region IX - West",null,"NEVADA","LAS VEGAS","Detached/Semi-Detached",129746.5505,227056.46350000001,168341.3008,294597.27649999998,201103.58180000001,351931.26799999998,239717.94500000001,419506.40370000002,282773.55489999999,494853.72100000002,310183.09350000002,542820.41370000003,335954.27990000002,587919.98990000004]
[9,"Region IX - West",null,"NEVADA","LAS VEGAS","Row House",109286.4942,191251.36489999999,145187.5319,254078.18090000001,178398.10019999999,312196.6753,223571.57800000001,391250.26140000002,269924.9461,472368.6556,297899.99839999998,521324.99709999998,324043.12089999998,567075.46149999998]
[9,"Region IX - West",null,"NEVADA","LAS VEGAS","Walkup",101167.6061,177043.3106,139784.73680000001,244623.28940000001,177349.40239999999,310361.45419999998,231708.95389999999,405490.66930000001,288649.02439999999,505135.79269999999,324889.23950000003,568556.1692,360600.90850000002,631051.59]
[9,"Region IX - West",null,"NEVADA","LAS VEGAS","Elevator",111875.82980000001,179001.33050000001,156626.16190000001,250601.8627,201376.4938,322202.39480000001,268501.99170000001,429603.19319999998,335627.48969999998,537003.9915,380377.82160000002,608604.52359999996,425128.15360000002,680205.05590000004]
[9,"Region IX - West",null,"NEVADA","RENO","Detached/Semi-Detached",118369.999,207147.49840000001,153711.58319999999,268995.27069999999,183740.8829,321546.54509999999,219180.24609999999,383565.43079999997,258659.46090000001,452654.05660000001,283779.30570000003,496613.78509999998,307441.85830000002,538023.25210000004]
[9,"Region IX - West",null,"NEVADA","RENO","Row House",98996.129400000005,173243.22640000001,131787.21669999999,230627.62940000001,162241.00099999999,283921.75170000002,203891.20749999999,356809.61330000003,246493.0785,431362.8873,272148.40960000001,476259.7169,296163.1495,518285.51169999997]
[9,"Region IX - West",null,"NEVADA","RENO","Walkup",91191.728900000002,159585.52559999999,125916.734,220354.28460000001,159645.15719999999,279379.02490000002,208355.87289999999,364622.77759999997,259510.08910000001,454142.65590000001,291984.38650000002,510972.6764,323958.20209999999,566926.85360000003]
[9,"Region IX - West",null,"NEVADA","RENO","Elevator",102050.3417,163280.5491,142870.47829999999,228592.76869999999,183690.61489999999,293904.98830000003,244920.82,391873.31770000001,306151.02490000002,489841.64720000001,346971.16159999999,555153.86679999996,387791.29820000002,620466.08649999998]